2,2-Dinitropropyl-4,4-dinitropentanoate
- Formula: C8H12N4O10
- Molecular weight: 324.2017
- IUPAC Standard InChIKey: LSLQRWZQQYHGBS-UHFFFAOYSA-N
- CAS Registry Number: 2555-54-6
- Chemical structure:
View 3d structure (requires JavaScript / HTML 5) - Permanent link for this species. Use this link for bookmarking this species for future reference.

Phase change data

Data compiled as indicated in comments:
TRC - Thermodynamics Research Center, NIST Boulder Laboratories, Chris Muzny director
AC - William E. Acree, Jr., James S. Chickos
Quantity | Value | Units | Method | Reference | Comment |
---|---|---|---|---|---|
Tfus | 370.8 | K | N/A | Rosen, Holden, et al., 1971 | Crystal phase 1 phase; Uncertainty assigned by TRC = 0.1 K; TRC |
Enthalpy of fusion
ΔfusH (kJ/mol) | Temperature (K) | Method | Reference | Comment |
---|---|---|---|---|
6.28 | 370.8 | DSC | Rosen, Holden, et al., 1971 | AC |

References

Rosen, Holden, et al., 1971
Rosen, J.M.; Holden, J.R.; Simmons, H.T., Sr.,
Microscope, 1971, 19, 2, 151. [all data]