Silane, diethoxydiphenyl-
- Formula: C16H20O2Si
- Molecular weight: 272.4143
- IUPAC Standard InChIKey: ZZNQQQWFKKTOSD-UHFFFAOYSA-N
- CAS Registry Number: 2553-19-7
- Chemical structure:
View 3d structure (requires JavaScript / HTML 5) - Other names: Diphenyldiethoxysilane; Diethoxydiphenylsilane; CD6000

Phase change data

Data compiled as indicated in comments:
BS - Robert L. Brown and Stephen E. Stein
AC - William E. Acree, Jr., James S. Chickos
Reduced pressure boiling point
Tboil (K) | Pressure (atm) | Reference | Comment |
---|---|---|---|
440. | 0.020 | PCR Inc., 1990 | BS |
Enthalpy of vaporization
ΔvapH (kcal/mol) | Temperature (K) | Reference | Comment |
---|---|---|---|
17.1 | 399. | Stull, 1947 | Based on data from 385. to 569. K.; AC |
Antoine Equation Parameters
log10(P) = A − (B / (T + C))
P = vapor pressure (atm)
T = temperature (K)
View plot Requires a JavaScript / HTML 5 canvas capable browser.
Temperature (K) | A | B | C | Reference | Comment |
---|---|---|---|---|---|
384.7 to 569. | 4.70645 | 2247.823 | -89.561 | Stull, 1947 | Coefficents calculated by NIST from author's data. |

References

PCR Inc., 1990
PCR Inc.,
Research Chemicals Catalog 1990-1991, PCR Inc., Gainesville, FL, 1990, 1. [all data]
Stull, 1947
Stull, Daniel R.,
Vapor Pressure of Pure Substances. Organic and Inorganic Compounds,
Ind. Eng. Chem., 1947, 39, 4, 517-540, https://doi.org/10.1021/ie50448a022
. [all data]