2H-Pyran-2-one, tetrahydro-6-(2-pentenyl)-, (Z)-
- Formula: C10H16O2
- Molecular weight: 168.2328
- IUPAC Standard InChIKey: XPPALVZZCMPTIV-ARJAWSKDSA-N
- CAS Registry Number: 25524-95-2
- Chemical structure:
View 3d structure (requires JavaScript / HTML 5) - Stereoisomers:
- Other names: 5-Hydroxy-7(Z)-decenoic acid-δ-lactone; Jasmine lactone; Jasminlactone; (Z)-7-Decen-5-olide; δ-Jasmine lactone; cis-7-Decen-5-olide; Dec-7-en-5-olide, (Z)-; Dec-7(Z)-en-5-olide; (Z)-Dec-7-en-5-olide; cis-Jasmin lactone; Jasmolactone, δ-; (Z)-dec-7-en-5-olide [jasmine lactone]; (Z)-tetrahydro-6-(2-pentenyl)-2H-pyran-2-one

Van Den Dool and Kratz RI, non-polar column, custom temperature program

Column type | Active phase | I | Reference | Comment |
---|---|---|---|---|
Capillary | VF-5MS | 1517.8 | Tret'yakov, 2007 | 30. m/0.25 mm/0.25 μm, He; Program: Multi-step temperature program; T(initial)=60C; T(final)=270C |

Van Den Dool and Kratz RI, polar column, temperature ramp

Column type | Active phase | I | Reference | Comment |
---|---|---|---|---|
Capillary | DB-Wax Etr | 2255. | Aubert and Chanforan, 2007 | 30. m/0.25 mm/0.25 μm, 40. C @ 3. min, 5. K/min, 250. C @ 15. min |
Capillary | DB-Wax Etr | 2259. | Aubert C. and Pitrat M., 2006 | 30. m/0.25 mm/0.25 μm, He, 40. C @ 3. min, 5. K/min, 250. C @ 15. min |
Capillary | DB-Wax | 2245. | Shimoda, Shigematsu, et al., 1995 | 60. m/0.25 mm/0.25 μm, 2. K/min; Tstart: 50. C; Tend: 230. C |

Normal alkane RI, non-polar column, temperature ramp

Column type | Active phase | I | Reference | Comment |
---|---|---|---|---|
Capillary | DB-1 | 1442. | Engel, Flath, et al., 1988 | 60. m/0.315 mm/0.25 μm, He, 4. K/min; Tstart: 50. C; Tend: 250. C |

Normal alkane RI, polar column, temperature ramp

Column type | Active phase | I | Reference | Comment |
---|---|---|---|---|
Capillary | DB-Wax | 2256. | Ito, Sugimoto, et al., 2002 | 60. C @ 4. min, 3. K/min; Column length: 60. m; Column diameter: 0.25 mm; Tend: 180. C |
Capillary | DB-Wax | 2273. | Kumazawa and Masuda, 2002 | 30. m/0.25 mm/0.25 μm, He, 5. K/min; Tstart: 40. C; Tend: 210. C |
Capillary | DB-Wax | 2272. | Kumazawa and Masuda, 2002 | 60. m/0.25 mm/0.25 μm, He, 5. K/min; Tstart: 40. C; Tend: 210. C |
Capillary | DB-Wax | 2274. | Kumazawa and Masuda, 1999 | 30. m/0.53 mm/1. μm, 5. K/min; Tstart: 40. C; Tend: 210. C |
Capillary | DB-Wax | 2278. | Kumazawa and Masuda, 1999 | 60. m/0.25 mm/0.25 μm, 5. K/min; Tstart: 40. C; Tend: 210. C |
Capillary | Supelcowax | 2290. | Näf and Velluz, 1998 | He, 5. K/min; Column length: 60. m; Column diameter: 0.25 mm; Tstart: 80. C; Tend: 240. C |
Capillary | DB-Wax | 2226. | Werkhoff, Güntert, et al., 1998 | 60. m/0.32 mm/0.25 μm, H2, 3. K/min; Tstart: 60. C; Tend: 220. C |
Capillary | PEG-20M | 2253. | Togari, Kobayashi, et al., 1995 | 50. m/0.25 mm/0.15 μm, He, 60. C @ 4. min, 2. K/min; Tend: 180. C |
Capillary | DB-Wax | 2257. | Engel, Flath, et al., 1988 | 60. m/0.322 mm/0.25 μm, He, 4. K/min; Tstart: 50. C; Tend: 230. C |
Capillary | DB-Wax | 2236. | Takeoka, Flath, et al., 1988 | 60. m/0.25 mm/0.25 μm, H2, 30. C @ 2. min, 2. K/min; Tend: 180. C |
Capillary | DB-Wax | 2239. | Takeoka, Flath, et al., 1988 | 60. m/0.25 mm/0.25 μm, H2, 30. C @ 2. min, 2. K/min; Tend: 180. C |

References

Tret'yakov, 2007
Tret'yakov, K.V.,
Retention Data. NIST Mass Spectrometry Data Center., NIST Mass Spectrometry Data Center, 2007. [all data]
Aubert and Chanforan, 2007
Aubert, C.; Chanforan, C.,
Postharvest Changes in Physicochemical Properties and Volatile Constituents of Apricot (Prunus armeniaca L.). Characterization of 28 Cultivars,
J. Agric. Food Chem., 2007, 55, 8, 3074-3082, https://doi.org/10.1021/jf063476w
. [all data]
Aubert C. and Pitrat M., 2006
Aubert C.; Pitrat M.,
Volatile compounds in the skin and pulp of Queen Anne's pocket melon,
J. Agric. Food Chem., 2006, 54, 21, 8177-8182, https://doi.org/10.1021/jf061415s
. [all data]
Shimoda, Shigematsu, et al., 1995
Shimoda, M.; Shigematsu, H.; Shiratsuchi, H.; Osajima, Y.,
Comparison of the odor concentrates by SDE and adsorptive column method from green tea infusion,
J. Agric. Food Chem., 1995, 43, 6, 1616-1620, https://doi.org/10.1021/jf00054a037
. [all data]
Engel, Flath, et al., 1988
Engel, K.-H.; Flath, R.A.; Buttery, R.G.; Mon, T.R.; Ramming, D.W.; Teranishi, R.,
Investigation of volatile constituents in nectarines. 1. Analytical and sensory characterization of aroma components in some nectarine cultivars,
J. Agric. Food Chem., 1988, 36, 3, 549-553, https://doi.org/10.1021/jf00081a036
. [all data]
Ito, Sugimoto, et al., 2002
Ito, Y.; Sugimoto, A.; Kakuda, T.; Kubota, K.,
Identification of potent odorants in Chinese jasmine green tea scented with flowers of Jasminum sambac,
J. Agric. Food Chem., 2002, 50, 17, 4878-4884, https://doi.org/10.1021/jf020282h
. [all data]
Kumazawa and Masuda, 2002
Kumazawa, K.; Masuda, H.,
Identification of potent odorants in different green tea varieties using flavor dilution technique,
J. Agric. Food Chem., 2002, 50, 20, 5660-5663, https://doi.org/10.1021/jf020498j
. [all data]
Kumazawa and Masuda, 1999
Kumazawa, K.; Masuda, H.,
Identification of potent odorants in Japanese green tea (Sen-cha),
J. Agric. Food Chem., 1999, 47, 12, 5169-5172, https://doi.org/10.1021/jf9906782
. [all data]
Näf and Velluz, 1998
Näf, R.; Velluz, A.,
Phenols and lactones in Italo-Mitcham peppermint oil Mentha × piperita L.,
Flavour Fragr. J., 1998, 13, 3, 203-208, https://doi.org/10.1002/(SICI)1099-1026(199805/06)13:3<203::AID-FFJ725>3.0.CO;2-0
. [all data]
Werkhoff, Güntert, et al., 1998
Werkhoff, P.; Güntert, M.; Krammer, G.; Sommer, H.; Kaulen, J.,
Vacuum headspace method in aroma research: flavor chemistry of yellow passion fruits,
J. Agric. Food Chem., 1998, 46, 3, 1076-1093, https://doi.org/10.1021/jf970655s
. [all data]
Togari, Kobayashi, et al., 1995
Togari, N.; Kobayashi, A.; Aishima, T.,
Pattern recognition applied to gas chromatographic profiles of volatile components in three tea categories,
Food Res. Int., 1995, 28, 5, 495-502, https://doi.org/10.1016/0963-9969(95)00029-1
. [all data]
Takeoka, Flath, et al., 1988
Takeoka, G.R.; Flath, R.A.; Güntert, M.; Jennings, W.,
Nectarine volatiles: vacuum steam distillation versus headspace sampling,
J. Agric. Food Chem., 1988, 36, 3, 553-560, https://doi.org/10.1021/jf00081a037
. [all data]