Sulfur hexafluoride
- Formula: F6S
- Molecular weight: 146.055
- IUPAC Standard InChIKey: SFZCNBIFKDRMGX-UHFFFAOYSA-N
- CAS Registry Number: 2551-62-4
- Chemical structure:

Gas phase thermochemistry data

Quantity | Value | Units | Method | Reference | Comment |
---|---|---|---|---|---|
ΔfH°gas | -1220.47 | kJ/mol | Review | Chase, 1998 | Data last reviewed in June, 1976 |
Quantity | Value | Units | Method | Reference | Comment |
S°gas,1 bar | 291.52 | J/mol*K | Review | Chase, 1998 | Data last reviewed in June, 1976 |
Gas Phase Heat Capacity (Shomate Equation)
Cp° = A + B*t + C*t2 + D*t3 +
E/t2
H° − H°298.15= A*t + B*t2/2 +
C*t3/3 + D*t4/4 − E/t + F − H
S° = A*ln(t) + B*t + C*t2/2 + D*t3/3 −
E/(2*t2) + G
Cp = heat capacity (J/mol*K)
H° = standard enthalpy (kJ/mol)
S° = standard entropy (J/mol*K)
t = temperature (K) / 1000.
View plot Requires a JavaScript / HTML 5 canvas capable browser.
Temperature (K) | 298. to 1000. | 1000. to 6000. |
---|---|---|
A | 58.90319 | 157.1393 |
B | 255.5399 | 0.484022 |
C | -252.2747 | -0.100724 |
D | 88.76063 | 0.007127 |
E | -1.608971 | -8.279635 |
F | -1252.744 | -1291.990 |
G | 287.9914 | 443.2111 |
H | -1220.473 | -1220.473 |
Reference | Chase, 1998 | Chase, 1998 |
Comment | Data last reviewed in June, 1976 | Data last reviewed in June, 1976 |

Reaction thermochemistry data

Data compiled by: John E. Bartmess
Individual Reactions
By formula: (F- • F6S) + F6S = (F- • 2F6S)
Quantity | Value | Units | Method | Reference | Comment |
---|---|---|---|---|---|
ΔrH° | 16.7 ± 1.3 | kJ/mol | TDAs | Hiraoka, Shimizu, et al., 1995 | gas phase; Entropy estimated. Gaff = +1.4 at 141 K |
Quantity | Value | Units | Method | Reference | Comment |
ΔrG° | -5.9 ± 1.3 | kJ/mol | TDAs | Hiraoka, Shimizu, et al., 1995 | gas phase; Entropy estimated. Gaff = +1.4 at 141 K |
By formula: F6S- + F6S = (F6S- • F6S)
Quantity | Value | Units | Method | Reference | Comment |
---|---|---|---|---|---|
ΔrH° | 9.6 ± 1.3 | kJ/mol | TDAs | Hiraoka, Shimizu, et al., 1995 | gas phase; Entropy estimated. Gaff=+0.37 at 141K |
Quantity | Value | Units | Method | Reference | Comment |
ΔrG° | -13.0 ± 1.3 | kJ/mol | TDAs | Hiraoka, Shimizu, et al., 1995 | gas phase; Entropy estimated. Gaff=+0.37 at 141K |
By formula: F- + F6S = (F- • F6S)
Quantity | Value | Units | Method | Reference | Comment |
---|---|---|---|---|---|
ΔrH° | 22.6 ± 1.3 | kJ/mol | TDAs | Hiraoka, Shimizu, et al., 1995 | gas phase |
Quantity | Value | Units | Method | Reference | Comment |
ΔrG° | -3. ± 13. | kJ/mol | TDAs | Hiraoka, Shimizu, et al., 1995 | gas phase |
By formula: C6H4N2O4- + F6S = (C6H4N2O4- • F6S)
Quantity | Value | Units | Method | Reference | Comment |
---|---|---|---|---|---|
ΔrH° | <35.6 | kJ/mol | IMRB | Chowdhury and Kebarle, 1986 | gas phase |
Quantity | Value | Units | Method | Reference | Comment |
ΔrG° | <7.95 | kJ/mol | IMRB | Chowdhury and Kebarle, 1986 | gas phase |
By formula: C6H4N2O4- + F6S = (C6H4N2O4- • F6S)
Quantity | Value | Units | Method | Reference | Comment |
---|---|---|---|---|---|
ΔrH° | <35.1 | kJ/mol | IMRB | Chowdhury and Kebarle, 1986 | gas phase |
Quantity | Value | Units | Method | Reference | Comment |
ΔrG° | <7.11 | kJ/mol | IMRB | Chowdhury and Kebarle, 1986 | gas phase |
By formula: F5S- + F6S = (F5S- • F6S)
Quantity | Value | Units | Method | Reference | Comment |
---|---|---|---|---|---|
ΔrH° | <9.62 | kJ/mol | TDAs | Hiraoka, Shimizu, et al., 1995 | gas phase; No formation at 141 K |
By formula: Cl- + F6S = (Cl- • F6S)
Quantity | Value | Units | Method | Reference | Comment |
---|---|---|---|---|---|
ΔrG° | <7.53 | kJ/mol | IMRB | Chowdhury and Kebarle, 1986 | gas phase |

Henry's Law data

Data compiled by: Rolf Sander
Henry's Law constant (water solution)
kH(T) = k°H exp(d(ln(kH))/d(1/T) ((1/T) - 1/(298.15 K)))
k°H = Henry's law constant for solubility in water at 298.15 K (mol/(kg*bar))
d(ln(kH))/d(1/T) = Temperature dependence constant (K)
k°H (mol/(kg*bar)) | d(ln(kH))/d(1/T) (K) | Method | Reference |
---|---|---|---|
0.00024 | 2400. | L | N/A |

Normal alkane RI, non-polar column, custom temperature program

Column type | Active phase | I | Reference | Comment |
---|---|---|---|---|
Capillary | SPB-1 | 135. | Flanagan, Streete, et al., 1997 | 60. m/0.53 mm/5. μm, He; Program: 40C(6min) => 5C/min => 80C => 10C/min => 200C |
Capillary | SPB-1 | 135. | Strete, Ruprah, et al., 1992 | 60. m/0.53 mm/5.0 μm, Helium; Program: 40 0C (6 min) 5 0C/min -> 80 0C 10 0C/min -> 200 0C |

References

Chase, 1998
Chase, M.W., Jr.,
NIST-JANAF Themochemical Tables, Fourth Edition,
J. Phys. Chem. Ref. Data, Monograph 9, 1998, 1-1951. [all data]
Hiraoka, Shimizu, et al., 1995
Hiraoka, K.; Shimizu, A.; Minamitsu, A.; Nasu, M.; Fujimaki, S.; Yamabe, S.,
The small binding energies of the negative cluster ions: SF5-(SF6)1, SF6-(SF6)1 and F-(SF6)n (n=1 and 2), in the gas phase,
Chem. Phys. Lett., 1995, 241, 5-6, 623, https://doi.org/10.1016/0009-2614(95)00676-U
. [all data]
Chowdhury and Kebarle, 1986
Chowdhury, S.; Kebarle, P.,
Role of Binding Energies in A-.B and A.B- Complexes in the Kinetics of Gas Phase Electron Transfer Reactions:A- + B = A + B- Involving Perfluoro Compounds: SF6, C6F11CF3,
J. Chem. Phys., 1986, 85, 9, 4989, https://doi.org/10.1063/1.451687
. [all data]
Flanagan, Streete, et al., 1997
Flanagan, R.J.; Streete, P.J.; Ramsey, J.D.,
Volatile Substance Abuse, UNODC Technical Series, No 5, United Nations, Office on Drugs and Crime, Vienna International Centre, PO Box 500, A-1400 Vienna, Austria, 1997, 56, retrieved from http://www.odccp.org/pdf/technicalseries1997-01-011.pdf. [all data]
Strete, Ruprah, et al., 1992
Strete, P.J.; Ruprah, M.; Ramsey, J.D.; Flanagan, R.J.,
Detection and identification of volatile substances by headspace capillary gas chromatography to aid the diagnosis of acute poisoning,
Analyst, 1992, 117, 7, 1111-1127, https://doi.org/10.1039/an9921701111
. [all data]