Cyclohexanemethanethiol
- Formula: C7H14S
- Molecular weight: 130.251
- IUPAC Standard InChIKey: FWBXAOOHHILPSR-UHFFFAOYSA-N
- CAS Registry Number: 2550-37-0
- Chemical structure:
View 3d structure (requires JavaScript / HTML 5) - Other names: Cyclohexylmethanethiol; Methanethiol, cyclohexyl-; c-C6H11CH2SH; (Cyclohexylmethyl)thiol

Reaction thermochemistry data

Data compiled by: John E. Bartmess
Individual Reactions
C7H13S- + =
By formula: C7H13S- + H+ = C7H14S
Quantity | Value | Units | Method | Reference | Comment |
---|---|---|---|---|---|
ΔrH° | 1475. ± 9.2 | kJ/mol | G+TS | Taft, 1987 | gas phase; value altered from reference due to change in acidity scale |
Quantity | Value | Units | Method | Reference | Comment |
ΔrG° | 1449. ± 8.4 | kJ/mol | IMRE | Taft, 1987 | gas phase; value altered from reference due to change in acidity scale |

Gas phase ion energetics data

Data evaluated as indicated in comments:
HL - Edward P. Hunter and Sharon G. Lias
Data compiled as indicated in comments:
B - John E. Bartmess
Quantity | Value | Units | Method | Reference | Comment |
---|---|---|---|---|---|
Proton affinity (review) | 813.6 | kJ/mol | N/A | Hunter and Lias, 1998 | HL |
Quantity | Value | Units | Method | Reference | Comment |
Gas basicity | 782.4 | kJ/mol | N/A | Hunter and Lias, 1998 | HL |
De-protonation reactions
C7H13S- + =
By formula: C7H13S- + H+ = C7H14S
Quantity | Value | Units | Method | Reference | Comment |
---|---|---|---|---|---|
ΔrH° | 1475. ± 9.2 | kJ/mol | G+TS | Taft, 1987 | gas phase; value altered from reference due to change in acidity scale; B |
Quantity | Value | Units | Method | Reference | Comment |
ΔrG° | 1449. ± 8.4 | kJ/mol | IMRE | Taft, 1987 | gas phase; value altered from reference due to change in acidity scale; B |

Normal alkane RI, non-polar column, isothermal

Column type | Active phase | Temperature (C) | I | Reference | Comment |
---|---|---|---|---|---|
Capillary | DC-200 | 70. | 1028. | Leppin, Gollnick, et al., 1969 | Argon; Column length: 100. m |

References

Taft, 1987
Taft, R.W.,
The Nature and Analysis of Substitutent Electronic Effects,
Personal communication. See also Prog. Phys. Org. Chem., 1987, 16, 1. [all data]
Hunter and Lias, 1998
Hunter, E.P.; Lias, S.G.,
Evaluated Gas Phase Basicities and Proton Affinities of Molecules: An Update,
J. Phys. Chem. Ref. Data, 1998, 27, 3, 413-656, https://doi.org/10.1063/1.556018
. [all data]
Leppin, Gollnick, et al., 1969
Leppin, E.; Gollnick, K.; Schomburg, G.,
Gas chromatographic identification of isomeric mercaptans,
Chromatographia, 1969, 2, 12, 535-540, https://doi.org/10.1007/BF02260096
. [all data]