2-Octenal, (E)-
- Formula: C8H14O
- Molecular weight: 126.1962
- IUPAC Standard InChIKey: LVBXEMGDVWVTGY-VOTSOKGWSA-N
- CAS Registry Number: 2548-87-0
- Chemical structure:
View 3d structure (requires JavaScript / HTML 5) - Isotopologues:
- Stereoisomers:
- Other names: (E)-2-Octen-1-al; (E)-2-Octenal; trans-2-Octenal; trans-2-Octen-1-al; 2-(E)-Octenal; (E)-Oct-2-enal; Oct-2(E)-enal; Oct-(E)-2-enal; trans-Oct-2-enal

Phase change data

Data compiled by: Robert L. Brown and Stephen E. Stein
Reduced pressure boiling point
Tboil (K) | Pressure (bar) | Reference |
---|---|---|
358.2 | 0.025 | Aldrich Chemical Company Inc., 1990 |

Henry's Law data

Data compiled by: Rolf Sander
Henry's Law constant (water solution)
kH(T) = k°H exp(d(ln(kH))/d(1/T) ((1/T) - 1/(298.15 K)))
k°H = Henry's law constant for solubility in water at 298.15 K (mol/(kg*bar))
d(ln(kH))/d(1/T) = Temperature dependence constant (K)
k°H (mol/(kg*bar)) | d(ln(kH))/d(1/T) (K) | Method | Reference |
---|---|---|---|
13. | M | N/A |

Kovats' RI, non-polar column, temperature ramp

View large format table.

Column type Active phase I Reference Comment
CapillaryDB-11030.Takeoka, Perrino, et al., 199660. m/0.25 mm/0.25 μm, 30. C @ 4. min, 2. K/min; Tend: 220. C
CapillaryDB-11041.Takeoka, Perrino, et al., 199660. m/0.25 mm/0.25 μm, 30. C @ 4. min, 2. K/min; Tend: 220. C
CapillaryDB-51062.Ramarathnam, Rubin, et al., 1993He, 30. C @ 2. min, 10. K/min, 280. C @ 3. min; Column length: 30. m; Column diameter: 0.13 mm
CapillaryDB-51062.Ramarathnam, Rubin, et al., 1993, 2He, 30. C @ 2. min, 10. K/min, 280. C @ 3. min; Column length: 30. m; Column diameter: 0.13 mm
CapillarySE-301039.Greenberg, 1981He, 40. C @ 3. min, 3. K/min; Column length: 50. m; Column diameter: 0.5 mm; Tend: 170. C
CapillarySE-301040.Greenberg, 1981He, 40. C @ 3. min, 3. K/min; Column length: 50. m; Column diameter: 0.5 mm; Tend: 170. C
CapillarySE-301040.Greenberg, 1981, 2He, 70. C @ 2. min, 5. K/min, 170. C @ 5. min; Column length: 50. m; Column diameter: 0.5 mm
CapillarySE-301040.Greenberg, 1981, 2He, 70. C @ 2. min, 5. K/min, 170. C @ 5. min; Column length: 50. m; Column diameter: 0.5 mm

Kovats' RI, non-polar column, custom temperature program

View large format table.

Column type Active phase I Reference Comment
CapillaryBP-11047.Khan, Verma, et al., 200630. m/0.32 mm/0.25 μm, N2; Program: 60C => 5C/min => 220C (5min) => 3C/min => 245C(5min)

Kovats' RI, polar column, temperature ramp

View large format table.

Column type Active phase I Reference Comment
CapillaryBP-201433.Khan, Verma, et al., 200630. m/0.32 mm/0.25 μm, N2, 5. K/min, 220. C @ 14. min; Tstart: 60. C
CapillaryDB-Wax1434.Tatsuka, Suekane, et al., 199060. m/0.25 mm/0.25 μm, He, 40. C @ 5. min, 3. K/min; Tend: 200. C
CapillaryDB-Wax1434.Tatsuka, Suekane, et al., 199060. m/0.25 mm/0.25 μm, He, 40. C @ 5. min, 3. K/min; Tend: 200. C
CapillaryDB-Wax1425.Umano and Shibamoto, 1987He, 40. C @ 10. min, 2. K/min; Column length: 60. m; Column diameter: 0.25 mm; Tend: 200. C
CapillaryDB-Wax1424.Umano, Shoji, et al., 1986N2, 60. C @ 10. min, 2. K/min; Column length: 30. m; Column diameter: 0.25 mm; Tend: 200. C
CapillaryCarbowax 20M1430.Buttery, Kamm, et al., 1982He, 50. C @ 30. min, 1. K/min; Column length: 150. m; Column diameter: 0.64 mm; Tend: 170. C

Van Den Dool and Kratz RI, non-polar column, temperature ramp

View large format table.

Column type Active phase I Reference Comment
CapillaryDB-5MS1058.Cho, Namgung, et al., 200830. m/0.25 mm/0.25 μm, He, 40. C @ 1. min, 4. K/min, 200. C @ 10. min
CapillaryDB-5MS1052.Cho I.H., Lee S.M., et al., 200730. m/0.25 mm/0.25 μm, He, 40. C @ 1. min, 4. K/min, 200. C @ 10. min
CapillarySPB-51060.Engel and Ratel, 200760. m/0.32 mm/1. μm, 40. C @ 2. min, 3. K/min, 230. C @ 10. min
CapillaryRH-5MS1073.Hashizume M., Gordon M.H., et al., 200760. m/0.25 mm/0.25 μm, 40. C @ 2. min, 4. K/min, 350. C @ 10. min
CapillaryDB-5MS1058.Lozano P.R., Drake M., et al., 200730. m/0.25 mm/0.25 μm, He, 35. C @ 5. min, 10. K/min, 225. C @ 25. min
CapillaryDB-5MS1049.Lozano P.R., Drake M., et al., 200730. m/0.25 mm/0.25 μm, He, 35. C @ 5. min, 10. K/min, 225. C @ 25. min
CapillaryDB-51063.Methven L., Tsoukka M., et al., 200760. m/0.32 mm/1. μm, 40. C @ 2. min, 4. K/min, 260. C @ 10. min
CapillaryHP-5MS1056.7Zeng, Zhao, et al., 200730. m/0.25 mm/0.25 μm, He, 4. K/min; Tstart: 80. C; Tend: 300. C
CapillaryDB-5MS1052.Cho, Kim, et al., 200630. m/0.25 mm/0.25 μm, He, 40. C @ 1. min, 4. K/min, 200. C @ 10. min
CapillaryMega 5MS1025.Condurso, Verzera, et al., 200660. m/0.25 mm/0.25 μm, He, 3. K/min; Tstart: 60. C; Tend: 240. C
CapillarySPB-51063.Deport, Ratel, et al., 200660. m/0.32 mm/1. μm, He, 40. C @ 5. min, 3. K/min, 230. C @ 5. min
CapillaryHP-51064.Flamini, Tebano, et al., 200630. m/0.25 mm/0.25 μm, N2, 60. C @ 10. min, 5. K/min; Tend: 220. C
CapillaryCP Sil 5 CB1034.Ziegenbein, Hanssen, et al., 2006H2, 10. K/min; Column length: 25. m; Column diameter: 0.25 mm; Tstart: 80. C; Tend: 270. C
CapillaryCP Sil 5 CB1034.Ziegenbein, Hanssen, et al., 2006, 225. m/0.25 mm/0.4 μm, He, 10. K/min; Tstart: 80. C; Tend: 270. C
CapillaryDB-5MS1070.Carunchia Whetstine, Croissant, et al., 200530. m/0.25 mm/0.25 μm, 40. C @ 3. min, 10. K/min, 200. C @ 20. min
CapillaryCP-Sil 8CB-MS1063.Elmore, Cooper, et al., 20050. m/0.25 mm/0.25 μm, He, 40. C @ 2. min, 4. K/min, 280. C @ 5. min
CapillaryHP-5MS1063.Pino, Mesa, et al., 200530. m/0.25 mm/0.25 μm, He, 60. C @ 2. min, 4. K/min, 250. C @ 20. min
CapillaryHP-51062.Solina, Baumgartner, et al., 200525. m/0.2 mm/1. μm, He, 5. K/min, 280. C @ 5. min; Tstart: 40. C
CapillaryDB-51039.Avsar, Karagul-Yuceer, et al., 200430. m/0.25 mm/0.25 μm, 40. C @ 5. min, 10. K/min, 200. C @ 15. min
CapillaryZB-51061.Gocmen, Gurbuz, et al., 20040. m/0.32 mm/0.5 μm, 7. K/min, 265. C @ 5. min; Tstart: 40. C
CapillarySPB-51066.Píno, Marbot, et al., 200430. m/0.25 mm/0.25 μm, He, 60. C @ 2. min, 4. K/min, 250. C @ 20. min
CapillaryHP-51064.Campeol, Flamini, et al., 200330. m/0.25 mm/0.25 μm, N2, 60. C @ 10. min, 5. K/min; Tend: 220. C
CapillaryHP-51045.Campeol, Flamini, et al., 200330. m/0.25 mm/0.25 μm, N2, 60. C @ 10. min, 5. K/min; Tend: 220. C
CapillarySPB-11031.Chisholm, Jell, et al., 200330. m/0.25 mm/0.25 μm, He, 35. C @ 5. min, 4. K/min, 225. C @ 20. min
CapillaryHP-51064.Dural, Bagci, et al., 200330. m/0.25 mm/0.25 μm, N2, 60. C @ 10. min, 5. K/min; Tend: 220. C
CapillaryDB-51064.Flamini, Cioni, et al., 200330. m/0.25 mm/0.25 μm, He, 3. K/min; Tstart: 60. C; Tend: 240. C
CapillaryDB-51064.Flamini, Luigi Cioni, et al., 200330. m/0.25 mm/0.25 μm, He, 3. K/min; Tstart: 60. C; Tend: 240. C
CapillaryDB-51056.Högnadóttir and Rouseff, 200330. m/0.32 mm/0.5 μm, 7. K/min, 265. C @ 5. min; Tstart: 40. C
CapillaryDB-51058.2Xu, van Stee, et al., 200330. m/0.25 mm/1. μm, He, 2.5 K/min; Tstart: 50. C; Tend: 200. C
CapillaryBPX-51076.Bredie, Mottram, et al., 200250. m/0.32 mm/0.5 μm, 60. C @ 5. min, 4. K/min, 250. C @ 20. min
CapillaryCP Sil 8 CB1063.Elmore, Campo, et al., 200260. m/0.25 mm/0.25 μm, He, 40. C @ 2. min, 4. K/min; Tend: 280. C
CapillaryDB-51060.Karagül-Yüceer, Cadwallader, et al., 200230. m/0.32 mm/0.25 μm, 35. C @ 5. min, 10. K/min, 200. C @ 30. min
CapillaryCP Sil 8 CB1059.Oruna-Concha, Ames, et al., 200260. m/0.25 mm/0.25 μm, He, 40. C @ 8. min, 4. K/min, 250. C @ 10. min
CapillaryDB-11032.Kim, 200160. m/0.32 mm/1. μm, He, 40. C @ 5. min, 2. K/min; Tend: 220. C
CapillaryDB-5MS1045.Lee, Suriyaphan, et al., 200160. m/0.25 mm/0.25 μm, He, 40. C @ 5. min, 2. K/min, 200. C @ 30. min
CapillaryDB-5MS1045.Lee, Suriyaphan, et al., 200160. m/0.25 mm/0.25 μm, He, 40. C @ 5. min, 2. K/min, 200. C @ 30. min
CapillaryHP-51067.Shalit, Katzir, et al., 2001He, 50. C @ 1. min, 4. K/min; Column length: 30. m; Column diameter: 0.25 mm; Tend: 200. C
CapillaryCP Sil 8 CB1063.Elmore, Mottram, et al., 200060. m/0.25 mm/0.25 μm, He, 40. C @ 2. min, 4. K/min; Tend: 280. C
CapillaryHP-51056.Lazari, Skaltsa, et al., 200030. m/0.25 mm/0.25 μm, He, 50. C @ 5. min, 4. K/min; Tend: 280. C
CapillaryDB-11039.Wu, Wang, et al., 200060. m/0.25 mm/1. μm, N2, 5. K/min, 200. C @ 30. min; Tstart: 30. C
CapillaryBPX-51069.Mandin, Duckham, et al., 199950. m/0.32 mm/0.25 μm, He, 50. C @ 5. min, 4. K/min, 250. C @ 5. min
CapillaryBPX-51070.Mandin, Duckham, et al., 199950. m/0.32 mm/0.25 μm, He, 50. C @ 5. min, 4. K/min, 250. C @ 5. min
CapillaryHP-11030.Siegmund and Pfannhauser, 199925. m/0.2 mm/0.33 μm, 4. K/min, 250. C @ 2. min; Tstart: 35. C
CapillaryHP-51057.7Siegmund and Pfannhauser, 199930. m/0.25 mm/0.25 μm, 5.3 K/min, 250. C @ 2. min; Tstart: 35. C
CapillaryBPX-51076.Aaslyng, Elmore, et al., 199850. m/0.32 mm/0.50 μm, He, 4. K/min; Tstart: 40. C; Tend: 280. C
CapillaryDB-5MS1063.Cha and Cadwallader, 199830. m/0.32 mm/0.25 μm, 40. C @ 5. min, 6. K/min, 200. C @ 30. min
CapillaryDB-11035.Warthen, Lee, et al., 199725. m/0.2 mm/0.11 μm, He, 5. K/min; Tstart: 50. C; Tend: 250. C
CapillaryDB-11035.Warthen, Lee, et al., 199725. m/0.2 mm/0.11 μm, He, 5. K/min; Tstart: 50. C; Tend: 250. C
CapillarySE-301030.Misharina and Golovnya, 199650. m/0.32 mm/0.25 μm, 4. K/min; Tstart: 50. C; Tend: 250. C

Van Den Dool and Kratz RI, non-polar column, custom temperature program

View large format table.

Column type Active phase I Reference Comment
CapillaryDB-5MS1076.Varlet V., Knockaert C., et al., 200630. m/0.32 mm/0.5 μm, He; Program: 70C(1min) => 3C/min => 80C(1min) => 5C/min => 150C => 10C/min => 280C (4min)
CapillaryHP-51064.Boué, Shih, et al., 200350. m/0.2 mm/0.5 μm, He; Program: 40C(3min) => 10C/min => 60C =3C/min => 150C => 20C/min => 250C (5min)
CapillaryDB-51060.Lin and Blank, 200330. m/0.32 mm/0.25 μm, He; Program: 20C => 70C/min => 50C => 4C/min => 180C => 10C/min => 240C(10min)
CapillaryHP-51044.Carrapiso, Ventanas, et al., 200250. m/0.32 mm/1.05 μm; Program: 35C(5min) => 10C/min => 150C => 20C/min => 250C(10 min)
CapillaryCP Sil 8 CB1057.Fuhrmann and Grosch, 200225. m/0.32 mm/0.25 μm, He; Program: 35C(2min) => 5C/min => 170C => 20C/min => 240C (10min)
CapillaryDB-51057.Kirchhoff and Schieberle, 200225. m/0.32 mm/0.25 μm, He; Program: 35C (2min) => 40C/min => 50C (2min) => 4C/min => 240C (10min)
CapillaryCP Sil 8 CB1063.Oruna-Concha, Bakker, et al., 200260. m/0.25 mm/0.25 μm, He; Program: 0C => rapidly => 40C(8min) => 4C/min => 250C(10min)
CapillaryDB-51057.Beaulieu and Grimm, 200130. m/0.25 mm/0.25 μm, He; Program: 50C (1min) => 5C/min => 100C => 10C/min => 250C (9min)
CapillaryDB-51057.Blank, Lin, et al., 200130. m/0.32 mm/0.25 μm, He; Program: 20C => 70C/min => 50C => 4C/min => 180C => 10C/min => 240C(10min)
CapillaryDB-51057.Kirchhoff and Schieberle, 200125. m/0.32 mm/0.25 μm, He; Program: 35C(2min) => 40C/min => 50C(2min) => 4C/min => 240C(10min)
CapillaryCP-Sil 8CB-MS1063.Elmore, Mottram, et al., 2000, 260. m/0.25 mm/0.25 μm, He; Program: 0C(5min) => 40C/min => 40C (2min) => 4C/min => 280C
CapillaryDB-51057.Munk, Munch, et al., 200030. m/0.32 mm/0.25 μm; Program: 40C(2min) => 40C/min => 50C (1min) => 6C/min => 180C => 10C/min => 240C (5min)
CapillaryDB-51057.Munk, Munch, et al., 200030. m/0.32 mm/0.25 μm; Program: 40C(2min) => 40C/min => 50C (1min) => 6C/min => 180C => 10C/min => 240C (5min)
CapillarySE-541060.Tairu, Hofmann, et al., 200030. m/0.32 mm/0.25 μm, He; Program: 35C (2min) => 40C/min => 60C (2min) => 6C/min => 180C (5min) => 10C/min => 230C (5min)
CapillaryBPX-51070.Elmore, Mottram, et al., 199950. m/0.32 mm/0.5 μm, He; Program: 0C(5min) => 40C/min => 40C(2min) => 4C/min => 280C
CapillarySE-541059.Mutti and Grosch, 199960. m/0.32 mm/0.25 μm, He; Program: 40C(2min) => 5C/min => 70C(2min) => 6C/min => 250C(10min)
CapillaryRTX-51061.Mutti and Grosch, 1999Program: not specified
CapillaryBPX-51069.Bredie, Mottram, et al., 199850. m/0.32 mm/0.5 μm, He; Program: OC (5min) => 60C/min => 60C(5min) => 4C/min => 250C
CapillaryBPX-51073.Elmore, Mottram, et al., 199750. m/0.32 mm/0.5 μm, He; Program: 0C (10min) => 40C/min => 40C (2min) => 4C/min => 280C

Van Den Dool and Kratz RI, polar column, temperature ramp

View large format table.

Column type Active phase I Reference Comment
CapillaryDB-Wax1437.Cho, Namgung, et al., 200830. m/0.25 mm/0.25 μm, He, 40. C @ 1. min, 4. K/min, 200. C @ 10. min
CapillaryDB-Wax1430.Cho I.H., Lee S.M., et al., 200760. m/0.25 mm/0.25 μm, He, 40. C @ 1. min, 4. K/min, 200. C @ 10. min
CapillaryHP-Innowax1425.Hashizume M., Gordon M.H., et al., 200760. m/0.25 mm/0.25 μm, 40. C @ 2. min, 4. K/min, 250. C @ 10. min
CapillaryFFAP1423.Lozano P.R., Drake M., et al., 200730. m/0.25 mm/0.25 μm, He, 35. C @ 5. min, 10. K/min, 225. C @ 25. min
CapillaryFFAP1424.Lozano P.R., Drake M., et al., 200730. m/0.25 mm/0.25 μm, He, 35. C @ 5. min, 10. K/min, 225. C @ 25. min
CapillaryDB-Wax1437.Cho, Choi, et al., 200660. m/0.25 mm/0.25 μm, He, 40. C @ 1. min, 4. K/min, 200. C @ 10. min
CapillaryDB-Wax1430.Cho, Kim, et al., 200660. m/0.25 mm/0.25 μm, He, 40. C @ 1. min, 4. K/min, 200. C @ 10. min
CapillaryStabilwax1425.Cros, Lignot, et al., 200560. m/0.25 mm/0.25 μm, He, 40. C @ 5. min, 3. K/min, 240. C @ 10. min
CapillarySupelcowax-101439.Elmore, Nisyrios, et al., 200560. m/0.25 mm/0.25 μm, He, 40. C @ 2. min, 4. K/min; Tend: 280. C
CapillarySupelcowax-101425.Riu-Aumatell, Lopez-Tamames, et al., 200530. m/0.25 mm/0.25 μm, He, 60. C @ 5. min, 3. K/min, 240. C @ 10. min
CapillaryCarbowax 20M1407.Verzera, Campisi, et al., 200560. m/0.25 mm/0.25 μm, He, 45. C @ 0.17 min, 2. K/min; Tend: 250. C
CapillaryDB-FFAP1436.Avsar, Karagul-Yuceer, et al., 200415. m/0.32 mm/0.25 μm, He, 35. C @ 5. min, 10. K/min, 225. C @ 15. min
CapillaryDB-Wax1437.Gocmen, Gurbuz, et al., 20040. m/0.32 mm/0.5 μm, 7. K/min, 240. C @ 5. min; Tstart: 40. C
CapillaryDB-Wax1416.Mahajan, Goddik, et al., 200430. m/0.25 mm/0.5 μm, He, 40. C @ 2. min, 5. K/min, 230. C @ 10. min
CapillaryDB-Wax1434.Nielsen, Larsen, et al., 200430. m/0.25 mm/0.25 μm, He, 45. C @ 10. min, 6. K/min, 240. C @ 30. min
CapillaryDB-Wax1434.Nielsen, Larsen, et al., 2004, 230. m/0.25 mm/0.25 μm, He, 45. C @ 10. min, 6. K/min, 240. C @ 30. min
CapillaryDB-Wax1412.Nielsen and Poll, 200430. m/0.25 mm/0.25 μm, He, 45. C @ 10. min, 3. K/min, 240. C @ 30. min
CapillaryStabilwax1425.Cros, Vandanjon, et al., 200360. m/0.25 mm/0.25 μm, He, 40. C @ 5. min, 3. K/min, 240. C @ 10. min
CapillaryDB-Wax1442.Högnadóttir and Rouseff, 200330. m/0.32 mm/0.5 μm, 7. K/min, 240. C @ 5. min; Tstart: 40. C
CapillaryDB-Wax1434.Nielsen, Larsen, et al., 200330. m/0.25 mm/0.25 μm, He, 40. C @ 10. min, 6. K/min, 240. C @ 30. min
CapillaryZB-Wax1419.Brunton, Cronin, et al., 200260. m/0.32 mm/0.25 μm, He, 3. K/min; Tstart: 40. C; Tend: 220. C
CapillaryDB-Wax1416.Karagül-Yüceer, Cadwallader, et al., 200230. m/0.25 mm/0.25 μm, 35. C @ 5. min, 10. K/min, 200. C @ 30. min
CapillaryDB-FFAP1410.Karagül-Yüceer, Cadwallader, et al., 200230. m/0.25 mm/0.25 μm, 35. C @ 5. min, 10. K/min, 200. C @ 30. min
CapillaryDB-Wax1424.Kim, 200160. m/0.25 mm/0.25 μm, He, 40. C @ 5. min, 2. K/min, 200. C @ 30. min
CapillaryDB-Wax1430.Lee, Suriyaphan, et al., 200160. m/0.25 mm/0.25 μm, He, 2. K/min; Tstart: 40. C; Tend: 200. C
CapillaryDB-Wax1430.Lee, Suriyaphan, et al., 200160. m/0.25 mm/0.25 μm, He, 2. K/min; Tstart: 40. C; Tend: 200. C
CapillaryCP-Wax 52CB1407.Verzera, Campisi, et al., 200160. m/0.25 mm/0.25 μm, He, 45. C @ 0.17 min, 2. K/min; Tend: 250. C
CapillaryDB-Wax1451.le Guen, Prost, et al., 200060. m/0.32 mm/0.5 μm, He, 40. C @ 5. min, 3. K/min, 250. C @ 10. min
CapillaryCP-Wax 52CB1411.Jensen, Christensen, et al., 200050. m/0.25 mm/0.2 μm, He, 30. C @ 1.3 min, 2. K/min; Tend: 220. C
CapillarySupelcowax-101434.Chung, 199960. m/0.25 mm/0.25 μm, He, 35. C @ 5. min, 2. K/min, 195. C @ 90. min
CapillaryFFAP1467.Stephan and Steinhart, 199960. m/0.25 mm/0.5 μm, 50. C @ 3. min, 5. K/min, 230. C @ 15. min
CapillaryDB-Wax1421.Cha and Cadwallader, 199830. m/0.32 mm/0.25 μm, 40. C @ 5. min, 6. K/min, 200. C @ 30. min
CapillaryDB-Wax1425.Shimoda, Shigematsu, et al., 199560. m/0.25 mm/0.25 μm, 2. K/min; Tstart: 50. C; Tend: 230. C
CapillaryDB-Wax1435.Shiratsuchi, Shimoda, et al., 199460. m/0.25 mm/0.25 μm, 2. K/min, 230. C @ 60. min; Tstart: 50. C
CapillaryDB-Wax1435.Shiratsuchi, Shimoda, et al., 1994, 260. m/0.25 mm/0.25 μm, He, 2. K/min, 230. C @ 60. min; Tstart: 50. C
CapillaryCP-WAX 57CB1424.Salter L.J., Mottram D.S., et al., 198860. C @ 5. min, 4. K/min; Column length: 50. m; Column diameter: 0.32 mm; Tend: 200. C
CapillaryCarbowax 20M1417.Chen, Kuo, et al., 1986He, 50. C @ 5. min, 2. K/min, 200. C @ 40. min; Column length: 50. m; Column diameter: 0.32 mm

Van Den Dool and Kratz RI, polar column, custom temperature program

View large format table.

Column type Active phase I Reference Comment
CapillarySupelcowax-101432.Bianchi, Cantoni, et al., 200730. m/0.25 mm/0.25 μm; Program: 35C(8min) => 4C/min => 60C => 6C/min => 160C => 20C/min => 220C(1min)
CapillarySupelcowax-101432.Bianchi, Careri, et al., 200730. m/0.25 mm/0.25 μm, He; Program: 35C(8min) => 4C/min => 60C => 6C/min => 160C => 20C/min => 200C(1min)
CapillarySupelcowax-101438.Bianchi, Careri, et al., 200730. m/0.25 mm/0.25 μm, He; Program: 35C(8min) => 4C/min => 60C => 6C/min => 160C => 20C/min => 200C(1min)
CapillarySupelcowax-101432.Bianchi, Careri, et al., 200730. m/0.25 mm/0.25 μm, He; Program: 35C(8min) => 4C/min => 60C => 6C/min => 160C => 20C/min => 200C(1min)
CapillaryCP-Wax 52CB1432.Condurso, Verzera, et al., 200660. m/0.25 mm/0.25 μm, He; Program: 45C(5min) => 10C/min => 80C => 2C/min => 240C
CapillaryDB-Wax1425.Hallier, Prost, et al., 200530. m/0.32 mm/0.5 μm, He; Program: 40C(5min) => 10C/min => 160C => 15C/min => 230C
CapillaryCP-Wax 52CB1411.Kaack, Christensen, et al., 200550. m/0.25 mm/0.2 μm, He; Program: 33C(1.5min) => 1.5C/min => 60C(4min) => 2C/min => 100C => 8C/min => 220C(15min)
CapillaryDB-Wax1429.Pennarun, Prost, et al., 200330. m/0.32 mm/0.5 μm, He; Program: 50C => 6C/min => 70C => 4C/min => 150C => 10C/min => 250C
CapillaryHP-FFAP1410.Carrapiso, Ventanas, et al., 200230. m/0.32 mm/0.25 μm; Program: 35C(5min) => 10C/min => 150C => 20C/min => 250C(10 min)
CapillaryFFAP1412.Fuhrmann and Grosch, 200225. m/0.32 mm/0.3 μm, He; Program: 35C(2min) => 5C/min => 170C => 20C/min => 240C (10min)
CapillaryFFAP1419.Kirchhoff and Schieberle, 200230. m/0.32 mm/0.25 μm, He; Program: 35C (2min) => 60C/min => 50C (2min) => 6C/min => 240C (10min)
CapillaryFFAP1419.Kirchhoff and Schieberle, 200130. m/0.32 mm/0.25 μm, He; Program: 40C(2min) => 40C/min => 60C(2min) => 6C/min => 240C(10min)
CapillaryDB-FFAP1429.Munk, Johansen, et al., 200130. m/0.32 mm/0.25 μm; Program: 40C(2min) => 40C/min => 60C (2min) => 6C/min => 180C => 10C/min => 240C(5min)
CapillaryDB-FFAP1410.Munk, Munch, et al., 200030. m/0.32 mm/0.25 μm; Program: 40C(2min) => 40C/min => 60C (2min) => 6C/min => 180C => 10C/min => 240C (5min)
CapillaryDB-FFAP1408.Munk, Munch, et al., 200030. m/0.32 mm/0.25 μm; Program: 40C(2min) => 40C/min => 60C (2min) => 6C/min => 180C => 10C/min => 240C (5min)
CapillaryFFAP1434.Tairu, Hofmann, et al., 200030. m/0.32 mm/0.25 μm, He; Program: 35C (2min) => 40C/min => 60C (2min) => 6C/min => 180C (5min) => 10C/min => 230C (5min)
CapillaryDB-FFAP1413.Mutti and Grosch, 199930. m/0.32 mm/0.25 μm, He; Program: 40C(2min) => 40C/min => 60C(2min) => 6C/min => 230C(10min)
CapillaryHP-Innowax1451.Iversen, Jakobsen, et al., 199860. m/0.25 mm/0.25 μm, He; Program: 32C(1.5min) => 3C/min => 40C (10min) => 3C/min => 200C (10min)
CapillaryDB-Wax1447.Prost, Serot, et al., 199830. m/0.32 mm/0.5 μm; Program: 50C => 3C/min => 180C => 5C/min => 250C (15min)
CapillaryDB-Wax1467.3Yang, Chyau, et al., 1998He; Column length: 50. m; Column diameter: 0.32 mm; Program: 50C => 2.5C/min => 150C => 1.5C/min => 210C
CapillarySupelcowax-101421.Baek and Cadwallader, 199660. m/0.25 mm/0.25 μm; Program: 40C => (6C/min) => 80C(6min) => (15C/min) => 200C(10min)

Normal alkane RI, non-polar column, temperature ramp

View large format table.

Column type Active phase I Reference Comment
CapillaryVF-5 MS1063.Liu, Lu, et al., 201130. m/0.25 mm/0.25 μm, Helium, 40. C @ 3. min, 5. K/min, 250. C @ 3. min
CapillaryDB-51031.Pattiram, Lasekan, et al., 201130. m/0.32 mm/0.25 μm, Helium, 2. K/min; Tstart: 35. C; Tend: 200. C
CapillaryHP-51059.Piyachaiseth, Jirapakkul, et al., 201160. m/0.25 mm/0.25 μm, Helium, 35. C @ 1. min, 10. K/min, 220. C @ 15. min
CapillaryDB-5 MS1056.Chen, Song, et al., 200930. m/0.32 mm/0.25 μm, Helium, 40. C @ 2. min, 6. K/min, 230. C @ 20. min
CapillaryDB-5 MS1062.Chen, Song, et al., 200930. m/0.32 mm/0.25 μm, Helium, 40. C @ 2. min, 6. K/min, 250. C @ 20. min
CapillaryMega 5 MS1025.Romeo, Verzera, et al., 200960. m/0.25 mm/0.25 μm, Helium, 40. C @ 2. min, 3. K/min; Tend: 240. C
CapillaryHP-5 MS1044.Sylla, Berge, et al., 200930. m/0.32 mm/0.50 μm, Helium, 5. K/min, 250. C @ 5. min; Tstart: 50. C
CapillaryRTX-5 MS1058.Watcharananun, Cadwallader, et al., 200930. m/0.25 mm/0.50 μm, Helium, 35. C @ 5. min, 6. K/min, 225. C @ 10. min
CapillaryHP-5 MS1056.Zhao, Zeng, et al., 200930. m/0.25 mm/0.25 μm, Helium, 4. K/min; Tstart: 50. C; Tend: 280. C
CapillaryHP-51065.Flamini, Tebano, et al., 200830. m/0.25 mm/0.25 μm, N2, 60. C @ 10. min, 5. K/min; Tend: 220. C
CapillaryHP-5 MS1062.Forero, Quijano, et al., 200830. m/0.25 mm/0.25 μm, Helium, 50. C @ 4. min, 4. K/min, 230. C @ 10. min
CapillarySPB-11037.Frerot, Velluz, et al., 200830. m/0.25 mm/1.0 μm, Helium, 60. C @ 5. min, 5. K/min; Tend: 250. C
CapillaryHP-5 MS1062.Thakeow, Angeli, et al., 200830. m/0.25 mm/0.25 μm, Helium, 50. C @ 1.5 min, 6.5 K/min, 250. C @ 10. min
CapillaryCP Sil 8 CB1066.Marques, Wendler, et al., 200730. m/0.25 mm/0.25 μm, Helium, 50. C @ 3. min, 5. K/min; Tend: 280. C
CapillarySPB-51061.Vasta, Ratel, et al., 200760. m/0.32 mm/1. μm, 40. C @ 5. min, 3. K/min, 230. C @ 5. min
CapillaryHP-11033.Castel, Fernandez, et al., 200650. m/0.2 mm/0.5 μm, He, 2. K/min, 250. C @ 120. min; Tstart: 60. C
CapillaryHP-5MS1059.Hadaruga, Hadaruga, et al., 200630. m/0.25 mm/0.25 μm, He, 4. K/min; Tstart: 50. C; Tend: 250. C
CapillaryPE-51060.Pandey-Rai S., Mallavarapu G.R., et al., 200650. m/0.32 mm/0.25 μm, He, 100. C @ 1. min, 3. K/min; Tend: 280. C
CapillaryDB-51064.Senatore, Landolfi, et al., 200630. m/0.25 mm/0.25 μm, He, 40. C @ 5. min, 2. K/min, 260. C @ 20. min
CapillaryDB-51059.Shen X., Gao Y., et al., 200630. m/0.25 mm/0.25 μm, He, 40. C @ 2. min, 4. K/min, 250. C @ 10. min
CapillaryHP-11033.Bendimerad and Bendiab, 200550. m/0.2 mm/0.5 μm, He, 2. K/min, 250. C @ 60. min; Tstart: 60. C
CapillaryBPX51060.Boustie, Rapior, et al., 200525. m/0.20 mm/0.13 μm, He, 50. C @ 2. min, 3. K/min; Tend: 230. C
CapillaryHP-5MS1051.Krist, Stuebiger, et al., 200530. m/0.25 mm/0.25 μm, 38. C @ 1. min, 5. K/min, 220. C @ 2. min
CapillaryMDN-51060.van Loon, Linssen, et al., 200560. m/0.25 mm/0.25 μm, He, 40. C @ 4. min, 4. K/min, 270. C @ 5. min
CapillaryMDN-51060.van Loon, Linssen, et al., 200560. m/0.25 mm/0.25 μm, He, 40. C @ 4. min, 4. K/min, 270. C @ 5. min
CapillarySPB-51054.Pino, Marbot, et al., 200530. m/0.25 mm/0.25 μm, He, 60. C @ 2. min, 4. K/min, 250. C @ 20. min
CapillaryHP-51046.Utsunomia, Kawata, et al., 200530. m/0.32 mm/0.25 μm, Helium, 4. K/min, 300. C @ 5. min; Tstart: 40. C
CapillaryHP-51058.N/A30. m/0.32 mm/0.25 μm, Helium, 40. C @ 2. min, 5. K/min, 250. C @ 5. min
Capillary5 % Phenyl methyl siloxane1060.Ramírez, Estévez, et al., 20040. m/0.25 mm/1. μm, He, 40. C @ 10. min, 7. K/min, 250. C @ 5. min
CapillarySE-541061.Tura, Prenzler, et al., 200430. m/0.25 mm/0.25 μm, N2, 40. C @ 4. min, 5. K/min, 200. C @ 10. min
CapillaryDB-51055.Dhanda, Pegg, et al., 200360. m/0.25 mm/0.25 μm, He, 35. C @ 2. min, 5. K/min, 280. C @ 4. min
CapillaryMDN-51071.Mildner-Szkudlarz, Jelen, et al., 200330. m/0.25 mm/0.25 μm, He, 40. C @ 1. min, 20. K/min, 280. C @ 1. min
CapillarySPB-11032.Vichi, Castellote, et al., 200330. m/0.25 mm/0.25 μm, He, 40. C @ 10. min, 3. K/min; Tend: 200. C
CapillaryOptima-11043.Brun, Bessière, et al., 200125. m/0.20 mm/0.25 μm, He, 50. C @ 3. min, 3. K/min; Tend: 250. C
CapillaryHP-51064.Campeol, Flamini, et al., 200130. m/0.25 mm/0.25 μm, N2, 60. C @ 10. min, 5. K/min; Tend: 220. C
CapillaryOptima-11042.de Beck, Bessière, et al., 200025. m/0.20 mm/0.25 μm, He, 50. C @ 3. min, 3. K/min; Tend: 250. C
CapillaryHP-51062.García, Martín, et al., 200060. m/0.32 mm/1. μm, He, 3. K/min; Tstart: 40. C; Tend: 240. C
CapillaryMethyl Silicone1030.Vendramini and Trugo, 200050. m/0.25 mm/0.5 μm, H2, 40. C @ 0.5 min, 4. K/min; Tend: 260. C
CapillarySPB-11033.Wong and Lai, 199650. m/0.2 mm/0.33 μm, He, 40. C @ 3. min, 3. K/min, 200. C @ 30. min
CapillaryOV-1011031.Tamura, Nakamoto, et al., 1995N2, 2. K/min; Column length: 50. m; Column diameter: 0.25 mm; Tstart: 80. C; Tend: 200. C
CapillaryOV-1011035.Tamura, Nakamoto, et al., 1995N2, 2. K/min; Column length: 50. m; Column diameter: 0.25 mm; Tstart: 80. C; Tend: 200. C
CapillaryDB-51060.Lee, Macku, et al., 199160. m/0.25 mm/0.25 μm, 40. C @ 5. min, 2. K/min; Tend: 250. C
CapillaryDB-51067.Macku and Shibamoto, 1991He, 40. C @ 5. min, 2. K/min; Column length: 60. m; Column diameter: 0.25 mm; Tend: 160. C
CapillaryOV-1011039.Sugisawa, Nakamura, et al., 1990Nitrogen, 2. K/min; Column length: 50. m; Column diameter: 0.25 mm; Tstart: 70. C; Tend: 200. C
CapillaryOV-1011031.Yang and Sugisawa, 1990N2, 2. K/min; Column length: 50. m; Column diameter: 0.25 mm; Tstart: 80. C; Tend: 200. C
CapillaryOV-1011035.Yang and Sugisawa, 1990N2, 2. K/min; Column length: 50. m; Column diameter: 0.25 mm; Tstart: 80. C; Tend: 200. C
CapillaryOV-1011031.Stern, Flath, et al., 198550. C @ 0.1 min, 4. K/min, 225. C @ 30. min; Column length: 50. m; Column diameter: 0.32 mm
CapillarySE-301033.Heydanek and McGorrin, 198140. C @ 3. min, 3. K/min; Column length: 50. m; Column diameter: 0.5 mm; Tend: 170. C
CapillarySF-961043.Donetzhuber, Johansson, et al., 1976Nitrogen, 3. K/min, 130. C @ 40. min; Column length: 111. m; Column diameter: 0.76 mm; Initial hold: 8. min

Normal alkane RI, non-polar column, custom temperature program

View large format table.

Column type Active phase I Reference Comment
CapillaryTR-5 MS1055.Kurashov, Mitrukova, et al., 201415. m/0.25 mm/0.25 μm, Helium; Program: 35 0C (3 min) 2 0C/min -> 60 0C (3 min) 2 0C/min -> 80 0C (3 min) 4 0C/min -> 120 0C (3 min) 5 0C/min -> 150 0C (3 min) 15 0C/min -> 240 0C (10 min)
CapillaryTR-5 MS1071.Kurashov, Krylova, et al., 201315. m/0.25 mm/0.25 μm, Helium; Program: 35 0C (3 min) 2 0C/min -> 60 0C (3 min) 2 0C/min -> 80 0C (3 min) 4 0C/min -> 120 0C (3 min) 5 0C/min -> 150 0C (3 mion) 15 0C/min -> 240 0C (10 min)
CapillarySiloxane, 5 % Ph1055.VOC BinBase, 2012Program: not specified
CapillaryVF-5 MS1058.Liu, Lu, et al., 201130. m/0.25 mm/0.25 μm, Helium; Program: not specified
CapillaryDB-51067.Miyazaki, Plotto, et al., 201160. m/0.25 mm/1.00 μm, Helium; Program: 40 0C 4 0C/min -> 230 0C 100 0C/min -> 260 0C (11.7 min)
CapillaryPolydimethyl siloxane, 5 % phenyl1055.Skogerson, Wohlgemuth, et al., 2011Program: not specified
CapillaryDB-51066.Courtois, Paine, et al., 200930. m/0.25 mm/0.25 μm, Helium; Program: 50 0C m6 0C/min -> 140 0C 5 0C/min -> 160 0C (1 min) 10 0C/min -> 200 0C
CapillaryHP-5 MS1055.Mancini, Arnold, et al., 200930. m/0.25 mm/0.25 μm, Helium; Program: 40 0C (5 min) 2 0C/min -> 270 0C -> 260 0C (20 min)
CapillaryHP-51062.Ventanas, Estevez, et al., 200850. m/0.32 mm/1.05 μm, Helium; Program: 40 0C (10 min) 5 0C/min -> 200 0C 15 0C/min -> 250 0C (10 min)
CapillaryDB-5 MS1063.Watanabe, Ueda, et al., 200830. m/0.32 mm/1.0 μm, Helium; Program: -10 0C (3 min) 50 0C/min -> 40 0C 5 0C/min -> 290 0C (5 min)
CapillaryHP-5 MS1057.Xie, Sun, et al., 200830. m/0.25 mm/0.25 μm, Helium; Program: 40 0C (2 min) 4 0C/min -> 220 0C 20 0C/min -> 280 0C
CapillaryDB-51057.Beaulieu and Lancaster, 200730. m/0.25 mm/0.25 μm; Program: 50C(1min) => 5C/min => 100C => 10C/min => 250C (9min)
CapillaryDB-51059.Buettner, 200730. m/0.32 mm/0.25 μm; Program: 40C(2min) => 40C/min => 60C(2min) => 6C/min => 180C => 15C/min => 230C(10min)
CapillaryHP-51044.Carrapiso and Garsia, 200750. m/0.32 mm/1.05 μm; Program: 35 0C (10 min) 10 0C/min -> 150 0C 20 0C/min -> 250 0C (10 min)
CapillaryHP-51057.Dou, Li, et al., 200730. m/0.32 mm/0.25 μm, He; Program: 40 0C (2 min) 110 0C (2 min) 3 0C/min -> 170 0C (2 min) 4 0C/min -> 220 0C (2 min) 10 0C/min -> 260 0C (5 min)
CapillaryDB-5 MS1064.Liu, Xu, et al., 200760. m/0.32 mm/1.0 μm, Helium; Program: 40 0C (2 min) 6 0C/min -> 100 0C 4 0C/min -> 180 0C 8 0C/min -> 250 0C (12 min)
CapillaryHP-51056.Splivallo, Bossi, et al., 2007He; Program: 50C => 3C/min => 200C(10min) => 10C/min => 290C(10min)
Capillary5 % Phenyl methyl siloxane1063.Beaulieu J.C. and Lea J.M., 200630. m/0.25 mm/0.75 μm; Program: 50C(1min) => 5C/min => 100C => 10C/min => 190C => 30C/min => 250C(1min)
CapillarySE-541060.Blank, Lin, et al., 200630. m/0.32 mm/0.25 μm, Helium; Program: not specified
CapillaryHP-51060.Riu-Aumatell, Lopez-Tamames, et al., 2005Program: not specified
CapillarySE-301045.Vinogradov, 2004Program: not specified
CapillaryDB-51056.Rapior, Breheret, et al., 200230. m/0.20 mm/1.0 μm; Program: not specified
CapillaryBPX-51071.Madruga, Arruda, et al., 200050. m/0.32 mm/0.50 μm, Helium; Program: 40 0C (5 min) 20 0C/min -> 60 0C (5 min) 4 0C/min -> 250 0C (10 min)
CapillarySE-541054.Lizárraga-Guerra, Guth, et al., 1997He; Column length: 30. m; Column diameter: 0.32 mm; Program: 35C => 40C/min => 60C (1min) => 6C/min => 250C
CapillarySE-541060.Schermann and Schieberle, 199730. m/0.32 mm/0.25 μm, He; Program: 35C (2min) => 40C/min => 60C (2min) => 6C/min => 180C => 10C/min => 240C
CapillarySE-541060.Schermann and Schieberle, 199730. m/0.32 mm/0.25 μm, He; Program: 35C (2min) => 40C/min => 60C (2min) => 6C/min => 180C => 10C/min => 240C
CapillaryDB-51062.Schieberle and Grosch, 1994He; Column length: 30. m; Column diameter: 0.32 mm; Program: 35C => 40C/min => 50C(2min) => 4C/min => 240C
CapillarySE-541058.Milo and Grosch, 1993He; Column length: 30. m; Column diameter: 0.32 mm; Program: 40 0C -> (unknowm rate) 50 0C (2 min) 6 0C/min -> 200 0C

Normal alkane RI, polar column, temperature ramp

View large format table.

Column type Active phase I Reference Comment
CapillaryAT-Wax1413.Kiss, Csoka, et al., 201160. m/0.25 mm/0.25 μm, Helium, 4. K/min; Tstart: 60. C; Tend: 280. C
CapillaryDB-Wax1427.Kumazawa, Sakai, et al., 201030. m/0.25 mm/0.25 μm, Helium, 3. K/min; Tstart: 40. C; Tend: 210. C
CapillaryTC-Wax1435.Miyazawa, Fujita, et al., 2010Helium, 40. C @ 3. min, 3. K/min; Column length: 60. m; Column diameter: 0.25 mm; Tend: 230. C
CapillaryCP Wax 52 CB1433.Birtic, Ginies, et al., 200930. m/0.32 mm/0.50 μm, Helium, 40. C @ 2. min, 4. K/min, 230. C @ 15. min
CapillaryDB-Wax1414.Chen, Song, et al., 200930. m/0.32 mm/0.25 μm, Helium, 40. C @ 2. min, 6. K/min, 230. C @ 20. min
CapillaryDB-Wax1422.Chen, Song, et al., 200930. m/0.32 mm/0.25 μm, Helium, 40. C @ 2. min, 6. K/min, 230. C @ 20. min
CapillaryStabilwax1436.Watcharananun, Cadwallader, et al., 200930. m/0.25 mm/0.50 μm, Helium, 35. C @ 5. min, 6. K/min, 225. C @ 10. min
CapillaryHP-Innowax1428.Thakeow, Angeli, et al., 200830. m/0.25 mm/0.25 μm, Helium, 50. C @ 1.5 min, 6.5 K/min, 250. C @ 10. min
CapillaryStabilwax1425.Cros, Vandanjon, et al., 200760. m/0.25 mm/0.25 μm, Helium, 40. C @ 5. min, 3. K/min, 240. C @ 10. min
CapillaryInnowax1429.Bendimerad and Bendiab, 200550. m/0.2 mm/0.5 μm, He, 2. K/min, 250. C @ 60. min; Tstart: 60. C
CapillarySupelcowax-101463.Rochat and Chaintreau, 200560. m/0.53 mm/1. μm, He, 40. C @ 2. min, 4. K/min, 240. C @ 20. min
CapillarySupelcowax-101467.Rochat and Chaintreau, 200560. m/0.53 mm/1. μm, He, 40. C @ 2. min, 4. K/min, 240. C @ 20. min
CapillarySupelcowax-101468.Rochat and Chaintreau, 200560. m/0.53 mm/1. μm, He, 40. C @ 2. min, 4. K/min, 240. C @ 20. min
CapillaryZB-Wax1400.N/A30. m/0.32 mm/0.25 μm, Helium, 40. C @ 2. min, 5. K/min, 250. C @ 5. min
CapillaryZB-Wax1400.Wu, Krings, et al., 200530. m/0.32 mm/0.25 μm, He, 40. C @ 2. min, 5. K/min, 250. C @ 10. min
CapillaryHP-FFAP1434.López, Guzmán, et al., 200430. m/0.25 mm/0.25 μm, He, 40. C @ 5. min, 5. K/min, 120. C @ 3. min
CapillaryStabilwax1425.Cros, Vandanjon, et al., 2003, 260. m/0.25 mm/0.25 μm, Helium, 40. C @ 5. min, 3. K/min, 240. C @ 10. min
CapillarySupelcowax-101425.Vichi, Castellote, et al., 200330. m/0.25 mm/0.25 μm, He, 40. C @ 10. min, 3. K/min; Tend: 200. C
CapillaryDB-Wax1430.Chyau and Mau, 200160. m/0.32 mm/0.25 μm, 50. C @ 5. min, 1.5 K/min, 210. C @ 10. min
CapillaryHP-FFAP1429.Preininger and Ullrich, 200150. m/0.32 mm/0.5 μm, 6. K/min, 230. C @ 15. min; Tstart: 35. C
CapillaryDB-Wax1428.Weckerle, Bastl-Borrmann, et al., 200130. m/0.25 mm/0.25 μm, He, 50. C @ 3. min, 4. K/min; Tend: 220. C
CapillarySupelcowax-101443.Girard and Durance, 200060. m/0.25 mm/0.25 μm, He, 35. C @ 10. min, 4. K/min; Tend: 200. C
CapillaryDB-Wax1426.Umano, Hagi, et al., 200060. m/0.25 mm/0.25 μm, He, 40. C @ 2. min, 2. K/min; Tend: 200. C
CapillaryDB-Wax1425.Buttery, Orts, et al., 199930. C @ 4. min, 2. K/min, 170. C @ 60. min; Column length: 60. m; Column diameter: 0.32 mm
CapillaryDB-Wax1429.Chyau and Mau, 199960. m/0.25 mm/0.25 μm, N2, 3. K/min; Tstart: 40. C; Tend: 210. C
CapillaryInnowax1441.Kaya, Baser, et al., 199960. m/0.25 mm/0.25 μm, He, 60. C @ 10. min; Tend: 220. C
CapillaryDB-Wax1464.Schlüter, Steinhart, et al., 199960. m/0.32 mm/0.5 μm, He, 34. C @ 3. min, 5. K/min, 200. C @ 10. min
CapillaryDB-Wax1423.Umano, Nakahara, et al., 199960. m/0.25 mm/0.25 μm, He, 40. C @ 2. min, 2. K/min; Tend: 200. C
CapillaryDB-Wax1425.Buttery and Ling, 199830. C @ 4. min, 2. K/min, 170. C @ 30. min; Column length: 60. m; Column diameter: 0.25 mm
CapillaryCarbowax 20M1400.Chatonnet and Dubourdieu, 199850. m/0.25 mm/0.25 μm, He, 3. K/min, 230. C @ 30. min; Tstart: 35. C
CapillaryDB-Wax1419.Horiuchi, Umano, et al., 199860. m/0.25 mm/1. μm, He, 3. K/min, 200. C @ 40. min; Tstart: 50. C
CapillaryInnowax1426.Petersen, Poll, et al., 199830. m/0.25 mm/0.25 μm, 40. C @ 10. min, 6. K/min, 240. C @ 25. min
CapillaryTC-Wax1433.Shuichi, Masazumi, et al., 199680. C @ 5. min, 3. K/min; Column length: 60. m; Column diameter: 0.25 mm; Tend: 240. C
CapillarySupelcowax-101426.Wong and Lai, 199660. m/0.25 mm/0.25 μm, He, 40. C @ 3. min, 3. K/min, 200. C @ 30. min
CapillaryPEG-20M1393.Togari, Kobayashi, et al., 199550. m/0.25 mm/0.15 μm, He, 60. C @ 4. min, 2. K/min; Tend: 180. C
CapillaryPEG-20M1399.Togari, Kobayashi, et al., 199550. m/0.25 mm/0.15 μm, He, 60. C @ 4. min, 2. K/min; Tend: 180. C
CapillaryDB-Wax1453.Chung, Eiserich, et al., 199360. C @ 4. min, 3. K/min; Column length: 60. m; Column diameter: 0.25 mm; Tend: 220. C
CapillaryCarbowax 20M1400.Kawakami, Kobayashi, et al., 1993He, 60. C @ 4. min, 2. K/min; Column length: 50. m; Column diameter: 0.25 mm; Tend: 180. C
CapillaryDB-Wax1392.Hatsuko, Kazuko, et al., 1992He, 60. C @ 10. min, 3. K/min; Column length: 30. m; Column diameter: 0.25 mm; Tend: 240. C
CapillarySupelcowax-101429.Hsieh, Williams, et al., 198960. m/0.25 mm/0.25 μm, He, 40. C @ 5. min, 1. K/min; Tend: 175. C
PackedCarbowax1421.Schieberle and Grosch, 1983He, Chromosorb G AW DMCS, 4. K/min; Column length: 3. m; Tstart: 60. C; Tend: 180. C
CapillaryCarbowax 20M1430.Buttery, Parker, et al., 198150. C @ 30. min, 1. K/min; Column length: 150. m; Column diameter: 0.64 mm; Tend: 170. C
CapillaryCarbowax 20M1430.Buttery, Ling, et al., 198050. C @ 30. min, 1. K/min; Column length: 150. m; Column diameter: 0.64 mm; Tend: 170. C

Normal alkane RI, polar column, custom temperature program

View large format table.

Column type Active phase I Reference Comment
CapillarySupelco CO Wax-101440.Prompona, Kandylis, et al., 201260. m/0.32 mm/0.25 μm, Helium; Program: 35 0C (6 min) 2 0C/min -> 60 0C (5 min) 5 0C/min -> 200 0C 25 0C/min -> 250 0C (6 min)
CapillarySOLGel-Wax1432.Johanningsmeier and McFeeters, 201130. m/0.25 mm/0.25 μm, Helium; Program: 40 0C (2 min) 5 0C/min -> 140 0C 10 0C/min -> 250 0C (3 min)
CapillarySOLGel-Wax1432.Johanningsmeier and McFeeters, 201130. m/0.25 mm/0.25 μm, Helium; Program: not specified
CapillaryDB-Wax1433.Miyazaki, Plotto, et al., 201160. m/0.25 mm/0.50 μm, Helium; Program: 40 0C 4 0C/min -> 230 0C 100 0C/min -> 260 0C (11.7 min)
CapillaryHP Innowax1466.Mancini, Arnold, et al., 200950. m/0.20 mm/0.25 μm, Helium; Program: 40 0C (5 min) 2 0C/min -> 270 0C -> 260 0C (20 min)
CapillaryCP-Wax 52 CB1428.Romeo, Verzera, et al., 200960. m/0.25 mm/0.25 μm, Helium; Program: 45 0C (5 min) 3 0C/min -> 150 0C 10 0C/min -> 240 0C
CapillaryCP-Wax 52 CB1411.Kaack and Christensen, 200850. m/0.25 mm/0.29 μm, Helium; Program: 33 0C (1 min) 2 0C/min -> 130 0C 10 0C/min -> 220 0C
CapillaryDB-FFAP1423.Buettner, 200730. m/0.32 mm/0.25 μm; Program: 40C(2min) => 40C/min => 60C(2min) => 6C/min => 180C => 15C/min => 230C(10min)
CapillaryHP-FFAP1410.Carrapiso and Garsia, 200730. m/0.32 mm/0.25 μm; Program: 35 0C (10 min) 10 0C/min -> 150 0C 20 0C/min -> 250 0C (10 min)
CapillaryDB-FFAP1420.Greger and Schieberle, 200730. m/0.32 mm/0.25 μm, He; Program: 40C(1min) => 7C/min => 180C => 10C/min => 240C (10min)
CapillaryInnowax FSC1441.Baser K.H.C., Ozek G., et al., 200660. m/0.25 mm/0.25 μm, He; Program: 60C(10min) => 4C/min => 220C (10min) => 1C/min => 240C
CapillaryInnowax FSC1441.Baser, Özek, et al., 200660. m/0.25 mm/0.25 μm, He; Program: 60C(10min) => 4C/min >220C (10min) => 1C/min => 240C
CapillaryInnowax FSC1441.Baser, Özek, et al., 200660. m/0.25 mm/0.25 μm, He; Program: 60C(10min) => 4C/min >220C (10min) => 1C/min => 240C
CapillaryHP-Innowax FSC1441.Suleimenov Y.M., Atazhanova G.A., et al., 200660. m/0.25 mm/0.25 μm, He; Program: 60(10min) => 4C/min => 220C(10min) => 1C/min => 240C
CapillaryHP-Innowax FSC1441.Tabanca, Demirci, et al., 200660. m/0.25 mm/0.25 μm; Program: 60C(10min) => 4C/min => 220C (10min) => 1C/min => 240C
CapillaryCarbowax 20M1407.Editorial paper, 2005Program: not specified
CapillaryCarbowax 20M1423.Editorial paper, 2005Program: not specified
CapillaryHP Innowax FSP1441.Altintas, Kose, et al., 200460. m/0.25 mm/0.25 μm, N2; Program: 60C(10min) => 4C/min => 220C(10min) => 1C/min => 240C
CapillaryInnowax FSC1441.Baser, Özek, et al., 200460. m/0.25 mm/0.25 μm, He; Program: 60C(10min) => 4C/min => 220C(10min) => 1C/min => 240C
CapillaryDB-Wax Etr1464.Landy, Nicklaus, et al., 200430. m/0.32 mm/1. μm, H2; Program: 35C => 10C/min => 110C => 5C/min => 180C => 10C/min => 220C(15min)
CapillaryCarbowax 20M1427.Vinogradov, 2004Program: not specified
CapillarySupelcowax-101421.Baek and Cadwallader, 200360. m/0.25 mm/0.25 μm; Program: not specified
CapillaryHP-Innowax FSC1441.Demirci, Baser, et al., 200360. m/0.25 mm/0.25 μm, He; Program: 60C (10min) => 4C/min => 220C (10min) => 1C/min => 240C
CapillaryHP-Innowax FSC1441.Erdemoglu, Sener, et al., 200360. m/0.25 mm/0.25 μm, He; Program: 60C(10min) => 4C/min => 220C(10min) => 1C/min => 240C
CapillaryHP-Innowax FSC1441.Kaya, Demirci, et al., 200360. m/0.25 mm/0.25 μm, N2; Program: 60C(10min) => 4C/min => 220C(10min) => 1C/min => 240C
CapillaryInnowax1441.Tunaher, Kirimer, et al., 200360. m/0.25 mm/0.25 μm, He; Program: 60C(10min) => 4C/min => 220C(10min) => 1C/min => 240C (20min)
CapillaryHP-Innowax FSC1441.Kaya, Demirci, et al., 200160. m/0.25 mm/0.25 μm; Program: 60C(10min) => 4C/min => 220C(10min) => 1C/min => 240C
CapillaryInnowax1441.Baser, Özek, et al., 200060. m/0.25 mm/0.25 μm, He; Program: 60 0C (10 min) 4 K/min -> 220 0C (10 min) 1 K/min -> 240 0C
CapillaryDB-Wax1434.Piveteau, le Guen, et al., 200060. m/0.32 mm/0.5 μm, He; Program: 50C(6min) => 1C/min => 130C => 10C/min => 240C (15min)
CapillaryDB-Wax1441.Piveteau, le Guen, et al., 200030. m/0.32 mm/0.5 μm, He; Program: 50C(5min) => 1C/min => 80C => 10C/min => 250C
CapillaryCP-Wax 52CB1419.Jakobsen, Hansen, et al., 199850. m/0.25 mm/0.2 μm, He; Program: 30C (1.5min) => 3C/min => 120C => 10C/min => 220C (3.5min)
CapillaryFFAP1433.Schermann and Schieberle, 199730. m/0.32 mm/0.25 μm, He; Program: 35C (2min) => 40C/min => 60C (2min) => 6C/min => 180C => 10C/min => 240C
CapillaryFFAP1433.Schermann and Schieberle, 199730. m/0.32 mm/0.25 μm, He; Program: 35C (2min) => 40C/min => 60C (2min) => 6C/min => 180C => 10C/min => 240C
CapillarySupelcowax 101422.Castioni and Kapetanidis, 199660. m/0.25 mm/0.25 μm, Helium; Program: 60 0C (10 min) 2 0C/min -> 80 0C 3 0C/min -> 100 0C 4 0C/min -> 220 0C (30 min)
CapillarySupelcowax 101427.Castioni and Kapetanidis, 199660. m/0.25 mm/0.25 μm, Helium; Program: not specified
CapillarySupelcowax 101437.Castioni and Kapetanidis, 199660. m/0.25 mm/0.25 μm, Helium; Program: not specified
CapillaryCP-Wax 52CB1416.Luning, Carey, et al., 1995Program: 40C => 2C/min => 150C => 10C/min => 250C
CapillaryCP Wax 52 CB1417.Patterson and Stevenson, 199550. m/0.32 mm/0.20 μm; Program: 50 0C (10 min) 2 0C/min -> 100 0C 5 0C/min -> 150 0C 7 0C/min -> 220 0C (20 min)
CapillaryFFAP1440.Blank, Stampfli, et al., 1994Program: not specified
CapillaryCP-Wax 52CB1418.Luning, de Rijk, et al., 199450. m/0.32 mm/1.5 μm; Program: 40C => 2C/min => 150C => 10C/min => 250C
CapillaryCP-Wax 52CB1418.Luning, de Rijk, et al., 199450. m/0.32 mm/1.5 μm; Program: 40C => 2C/min => 150C => 10C/min => 250C
CapillarySupelcowax-101409.Schieberle and Grosch, 1994He; Column length: 30. m; Column diameter: 0.32 mm; Program: 35C => 40C/min => 60C(2min) => 4C/min => 240C
CapillaryDB-Wax1434.Milo and Grosch, 199330. m/0.25 mm/0.5 μm, He; Program: 35C => 40C/min => 50C(2min) => 6C/min => 200C
CapillaryDB-Wax1396.Hatsuko, Kazuko, et al., 1992He; Column length: 30. m; Column diameter: 0.25 mm; Program: not specified

References

Aldrich Chemical Company Inc., 1990
Aldrich Chemical Company Inc.,
Catalog Handbook of Fine Chemicals, Aldrich Chemical Company, Inc., Milwaukee WI, 1990, 1. [all data]