3-methyl-3-octadecanol

Phase change data

Data compiled by: Thermodynamics Research Center, NIST Boulder Laboratories, Chris Muzny director

Quantity Value Units Method Reference Comment
Tfus305.40KN/ASorensen and Sorensen, 1948Uncertainty assigned by TRC = 2. K

In addition to the Thermodynamics Research Center (TRC) data available from this site, much more physical and chemical property data is available from the following TRC products:

References

Sorensen and Sorensen, 1948
Sorensen, J.S.; Sorensen, N.A., Pristane II. The Methyloctadecanes, Acta Chem. Scand., 1948, 2, 166. [all data]