Indan, 2-butyl-5-hexyl-
- Formula: C19H30
- Molecular weight: 258.4415
- IUPAC Standard InChIKey: JAUZOZVMGVOYCU-UHFFFAOYSA-N
- CAS Registry Number: 25446-32-6
- Chemical structure:

Phase change data

Data compiled by: Thermodynamics Research Center, NIST Boulder Laboratories, Chris Muzny director
Quantity | Value | Units | Method | Reference | Comment |
---|---|---|---|---|---|
Tfus | 239.45 | K | N/A | Anonymous, 1968 | Uncertainty assigned by TRC = 0.5 K |

References

Anonymous, 1968
Anonymous, R.,
Properties of hydrocarbon of high molecular weight, Am. Pet. Inst. Res. Proj. 42, Penn. State Univ., 1968. [all data]