Sulfur fluoride cation
- Formula: F3S+
- Molecular weight: 89.060
- CAS Registry Number: 25431-36-1

Gas phase thermochemistry data

Quantity | Value | Units | Method | Reference | Comment |
---|---|---|---|---|---|
S°gas,1 bar | 64.283 | cal/mol*K | Review | Chase, 1998 | Data last reviewed in December, 1976 |

Reaction thermochemistry data

Data compiled by: Michael M. Meot-Ner (Mautner) and Sharon G. Lias
Individual Reactions
(F3S+ • 2F6S-) + F6S- = (F3S+ • 3F6S-)
By formula: (F3S+ • 2F6S-) + F6S- = (F3S+ • 3F6S-)
Quantity | Value | Units | Method | Reference | Comment |
---|---|---|---|---|---|
ΔrH° | 4.0 | kcal/mol | PHPMS | Hiraoka, Shimizu, et al., 1995 | gas phase; Entropy change calculated or estimated |
Quantity | Value | Units | Method | Reference | Comment |
ΔrS° | 19. | cal/mol*K | N/A | Hiraoka, Shimizu, et al., 1995 | gas phase; Entropy change calculated or estimated |
(F3S+ • F6S-) + F6S- = (F3S+ • 2F6S-)
By formula: (F3S+ • F6S-) + F6S- = (F3S+ • 2F6S-)
Quantity | Value | Units | Method | Reference | Comment |
---|---|---|---|---|---|
ΔrH° | 4.5 | kcal/mol | PHPMS | Hiraoka, Shimizu, et al., 1995 | gas phase |
Quantity | Value | Units | Method | Reference | Comment |
ΔrS° | 19. | cal/mol*K | PHPMS | Hiraoka, Shimizu, et al., 1995 | gas phase |
By formula: F3S+ + F6S- = (F3S+ • F6S-)
Quantity | Value | Units | Method | Reference | Comment |
---|---|---|---|---|---|
ΔrH° | 7.4 | kcal/mol | PHPMS | Hiraoka, Shimizu, et al., 1995 | gas phase |
Quantity | Value | Units | Method | Reference | Comment |
ΔrS° | 25. | cal/mol*K | PHPMS | Hiraoka, Shimizu, et al., 1995 | gas phase |

References

Chase, 1998
Chase, M.W., Jr.,
NIST-JANAF Themochemical Tables, Fourth Edition,
J. Phys. Chem. Ref. Data, Monograph 9, 1998, 1-1951. [all data]
Hiraoka, Shimizu, et al., 1995
Hiraoka, K.; Shimizu, A.; Minamitsu, A.; Nasu, M. Fujimaki,
Gas-Phase Stability of Cluster Ions SFm+(SF6)n with m = 0-5 and n = 1-3,
J. Am. Soc. Mass Spectrom., 1995, 6, 12, 1137, https://doi.org/10.1016/1044-0305(95)00583-8
. [all data]