4H-1,3-Benzodioxin
- Formula: C8H8O2
- Molecular weight: 136.1479
- IUPAC Standard InChIKey: TWSIYGATPWEKBK-UHFFFAOYSA-N
- CAS Registry Number: 254-27-3
- Chemical structure:
View 3d structure (requires JavaScript / HTML 5) - Other names: 1,3-Benzodioxan

Phase change data

Data compiled by: Robert L. Brown and Stephen E. Stein
Quantity | Value | Units | Method | Reference | Comment |
---|---|---|---|---|---|
Tfus | 285.6 | K | N/A | Buckingham and Donaghy, 1982 |
Reduced pressure boiling point
Tboil (K) | Pressure (bar) | Reference |
---|---|---|
483. to 484. | 1.01 | Buckingham and Donaghy, 1982 |
373.6 to 374.6 | 0.027 | Buckingham and Donaghy, 1982 |

References

Buckingham and Donaghy, 1982
Buckingham, J.; Donaghy, S.M.,
Dictionary of Organic Compounds: Fifth Edition, Chapman and Hall, New York, 1982, 1. [all data]