[Ge(Et)3]2O
- Formula: C12H30Ge2O
- Molecular weight: 335.65
- CAS Registry Number: 2538-70-7

Condensed phase thermochemistry data

Data compiled by: José A. Martinho Simões
Quantity | Value | Units | Method | Reference | Comment |
---|---|---|---|---|---|
ΔfH°liquid | -147.0 ± 2.3 | kcal/mol | Review | Martinho Simões | |
ΔfH°liquid | -140.9 ± 3.8 | kcal/mol | Review | Martinho Simões | |
Quantity | Value | Units | Method | Reference | Comment |
ΔcH°liquid | -2270.1 ± 3.6 | kcal/mol | CC-SB | Rabinovich, Kiparisov, et al., 1971 | Please also see Pedley and Rylance, 1977. |
ΔcH°liquid | -2264.0 ± 2.0 | kcal/mol | CC-SB | Tel'noi and Rabinovich, 1966 | Please also see Cox and Pilcher, 1970. |

Phase change data

Data compiled by: José A. Martinho Simões
Quantity | Value | Units | Method | Reference | Comment |
---|---|---|---|---|---|
ΔvapH° | 14.0 ± 1.0 | kcal/mol | CC-SB | Tel'noi and Rabinovich, 1966 |

References

Martinho Simões
Martinho Simões, J.A.,
Private communication (see http://webbook.nist.gov/chemistry/om/). [all data]
Rabinovich, Kiparisov, et al., 1971
Rabinovich, I.B.; Kiparisov, E.G.; Aleksandrov, Y.A.,
Dokl. Akad. Nauk SSSR, 1971, 200, 5, 1116. [all data]
Pedley and Rylance, 1977
Pedley, J.B.; Rylance, J.,
Computer Analysed Thermochemical Data: Organic and Organometallic Compounds, University of Sussex, Brigton, 1977. [all data]
Tel'noi and Rabinovich, 1966
Tel'noi, V.I.; Rabinovich, I.B.,
Russ. J. Phys. Chem., 1966, 40, 842. [all data]
Cox and Pilcher, 1970
Cox, J.D.; Pilcher, G.,
Thermochemistry of Organic and Organometallic Compounds
in Academic Press, New York, 1970. [all data]