1,4-pentanediol, dinitrate
- Formula: C5H10N2O6
- Molecular weight: 194.1427
- IUPAC Standard InChIKey: XVWLQUXGMQFTPO-UHFFFAOYSA-N
- CAS Registry Number: 25385-63-1
- Chemical structure:
View 3d structure (requires JavaScript / HTML 5) - Species with the same structure:
- Other names: 2,4-Pentanediol dinitrate

Phase change data

Data compiled as indicated in comments:
TRC - Thermodynamics Research Center, NIST Boulder Laboratories, Chris Muzny director
AC - William E. Acree, Jr., James S. Chickos
Quantity | Value | Units | Method | Reference | Comment |
---|---|---|---|---|---|
Tfus | 254.7 | K | N/A | Kemp, Goldhaber, et al., 1957 | Uncertainty assigned by TRC = 0.1 K; TRC |
Enthalpy of vaporization
ΔvapH (kJ/mol) | Temperature (K) | Method | Reference | Comment |
---|---|---|---|---|
60.6 ± 5.9 | 303. | A,GS | Stephenson and Malanowski, 1987 | Based on data from 293. to 313. K. See also Kemp, Goldhagen, et al., 1957 and Dykyj, 1972.; AC |

References

Kemp, Goldhaber, et al., 1957
Kemp, M.D.; Goldhaber, S.; Zihlman, F.A.,
Vapor pressures and cryoscopic data for some aliphatic dinitroxy and trinitroxy compounds,
J. Phys. Chem., 1957, 61, 240-2. [all data]
Stephenson and Malanowski, 1987
Stephenson, Richard M.; Malanowski, Stanislaw,
Handbook of the Thermodynamics of Organic Compounds, 1987, https://doi.org/10.1007/978-94-009-3173-2
. [all data]
Kemp, Goldhagen, et al., 1957
Kemp, M.D.; Goldhagen, S.; Zihlman, F.A.,
Vapor Pressures and Cryoscopic Data for Some Aliphatic Dinitroxy and Trinitroxy Compounds,
J. Phys. Chem., 1957, 61, 2, 240-242, https://doi.org/10.1021/j150548a021
. [all data]
Dykyj, 1972
Dykyj, J.,
Petrochemia, 1972, 12, 1, 13. [all data]