Pyrido[2,3-d]pyridazine
- Formula: C7H5N3
- Molecular weight: 131.1347
- IUPAC Standard InChIKey: GIVUQTUKKWDKHE-UHFFFAOYSA-N
- CAS Registry Number: 253-73-6
- Chemical structure:
View 3d structure (requires JavaScript / HTML 5) - Other names: 1,6,7-Triazanaphthalene

Gas phase ion energetics data

Data compiled by: John E. Bartmess
Electron affinity determinations
EA (eV) | Method | Reference | Comment |
---|---|---|---|
1.00 ± 0.10 | IMRE | Dillow and Kebarle, 1989 | ΔGea(423 K) = -22.5 kcal/mol; ΔSea =-1.5, taken as that of anthracene, from Kebarle and Chowdhury, 1987.1,4,5-triazanaphthalene |

References

Dillow and Kebarle, 1989
Dillow, G.W.; Kebarle, P.,
Electron Affinities of aza-substituted polycyclic aromatic hydrocarbons,
Can. J. Chem., 1989, 67, 10, 1628, https://doi.org/10.1139/v89-249
. [all data]
Kebarle and Chowdhury, 1987
Kebarle, P.; Chowdhury, S.,
Electron affinities and electron transfer reactions,
Chem. Rev., 1987, 87, 513. [all data]