Pentane, 3-bromo-3-methyl-
- Formula: C6H13Br
- Molecular weight: 165.071
- IUPAC Standard InChIKey: ZRPQYKLJSOLRPZ-UHFFFAOYSA-N
- CAS Registry Number: 25346-31-0
- Chemical structure:
View 3d structure (requires JavaScript / HTML 5) - Other names: 3-Bromo-3-methylpentane

Phase change data

Data compiled by: Thermodynamics Research Center, NIST Boulder Laboratories, Chris Muzny director
Quantity | Value | Units | Method | Reference | Comment |
---|---|---|---|---|---|
Tfus | 180.95 | K | N/A | Timmermans, 1952 | Uncertainty assigned by TRC = 0.5 K |

Kovats' RI, non-polar column, isothermal

Column type | Active phase | Temperature (C) | I | Reference | Comment |
---|---|---|---|---|---|
Packed | Apiezon L | 100. | 929. | Castello and D'Amato, 1985 | He, Chromosorb W AW DMCS; Column length: 3. m |
Packed | Apiezon L | 125. | 944. | Castello and D'Amato, 1985 | He, Chromosorb W AW DMCS; Column length: 3. m |
Packed | Apiezon L | 75. | 916. | Castello and D'Amato, 1985 | He, Chromosorb W AW DMCS; Column length: 3. m |

Kovats' RI, polar column, isothermal

Column type | Active phase | Temperature (C) | I | Reference | Comment |
---|---|---|---|---|---|
Packed | Carbowax 20M | 100. | 1059. | Castello and D'Amato, 1985 | He, Chromosorb W AW DMCS; Column length: 3. m |
Packed | Carbowax 20M | 125. | 1037. | Castello and D'Amato, 1985 | He, Chromosorb W AW DMCS; Column length: 3. m |
Packed | Carbowax 20M | 75. | 1047. | Castello and D'Amato, 1985 | He, Chromosorb W AW DMCS; Column length: 3. m |

Normal alkane RI, non-polar column, isothermal

Column type | Active phase | Temperature (C) | I | Reference | Comment |
---|---|---|---|---|---|
Capillary | Apiezon L | 130. | 876. | Arruda, Junkes, et al., 2008 |

References

Timmermans, 1952
Timmermans, J.,
Freezing points of organic compounds. VVI New determinations.,
Bull. Soc. Chim. Belg., 1952, 61, 393. [all data]
Castello and D'Amato, 1985
Castello, G.; D'Amato, G.,
Gas Chromatography Separation and Identification of Linear and Branched-Chain Alkyl Bromides,
J. Chromatogr., 1985, 324, 363-371, https://doi.org/10.1016/S0021-9673(01)81335-2
. [all data]
Arruda, Junkes, et al., 2008
Arruda, A.C.S.; Junkes, B. da.S.; Souza, E.S.; Yunes, R.A.; Heizen, V.E.F.,
Semi-Emlirical Topological Index to Predict Properties of Halogenated Aliphatic Compounds,
J. Chemometrics, 2008, 22, 3-4, 186-194, https://doi.org/10.1002/cem.1121
. [all data]