Benzenebutanoic acid, γ-oxo-, methyl ester
- Formula: C11H12O3
- Molecular weight: 192.2112
- IUPAC Standard InChIKey: XVRCVKWYKYJEIG-UHFFFAOYSA-N
- CAS Registry Number: 25333-24-8
- Chemical structure:
View 3d structure (requires JavaScript / HTML 5) - Other names: Propionic acid, 3-benzoyl-, methyl ester; Methyl 3-benzoylpropionate; Methyl 3-benzoylpropanoate; Propionic acid, beta-benzoyl-, methyl ester

Phase change data

Data compiled by: Robert L. Brown and Stephen E. Stein
Reduced pressure boiling point
Tboil (K) | Pressure (bar) | Reference |
---|---|---|
454. to 458. | 0.027 | Frinton Laboratories Inc., 1986 |

References

Frinton Laboratories Inc., 1986
Frinton Laboratories Inc.,
Catalog Number 11, Frinton Laboratories Inc., Vineland, NJ, 1986, 99. [all data]