r-1,c-2,c-3,c-4-tetramethylcyclopentane

Phase change data

Data compiled by: Thermodynamics Research Center, NIST Boulder Laboratories, Chris Muzny director

Quantity Value Units Method Reference Comment
Tboil420.45KN/AAnonymous, 1963Uncertainty assigned by TRC = 0.2 K
Tboil420.45KN/AMiller and Greenlee, 1961Uncertainty assigned by TRC = 0.2 K
Quantity Value Units Method Reference Comment
Tfus172.83KN/AAnonymous, 1963Uncertainty assigned by TRC = 0.3 K
Tfus172.93KN/AAnonymous, 1963Uncertainty assigned by TRC = 0.1 K
Tfus172.83KN/AMiller and Greenlee, 1961Uncertainty assigned by TRC = 0.3 K
Tfus172.93KN/AMiller and Greenlee, 1961Uncertainty assigned by TRC = 0.1 K

In addition to the Thermodynamics Research Center (TRC) data available from this site, much more physical and chemical property data is available from the following TRC products:

References

Anonymous, 1963
Anonymous, R., , E. I. Du Pont, 1963. [all data]

Miller and Greenlee, 1961
Miller, H.M.; Greenlee, K.W., Synthesis of 1,2,3,4,-tetramethylcyclopentanes. 1, J. Org. Chem., 1961, 26, 3734. [all data]