Phenanthrene, 2-methyl-
- Formula: C15H12
- Molecular weight: 192.2558
- IUPAC Standard InChIKey: KANLOADZXMMCQA-UHFFFAOYSA-N
- CAS Registry Number: 2531-84-2
- Chemical structure:
View 3d structure (requires JavaScript / HTML 5) - Isotopologues:
- Other names: 2-Methylphenanthrene

Phase change data

Data compiled as indicated in comments:
BS - Robert L. Brown and Stephen E. Stein
TRC - Thermodynamics Research Center, NIST Boulder Laboratories, Chris Muzny director
Quantity | Value | Units | Method | Reference | Comment |
---|---|---|---|---|---|
Tfus | 330. | K | N/A | Colonge and Kehlstadt, 1955 | Uncertainty assigned by TRC = 3. K; TRC |
Tfus | 329. | K | N/A | Adkins and Davis, 1949 | Uncertainty assigned by TRC = 3. K; TRC |
Tfus | 328. | K | N/A | Tatevosyan and Vardanyan, 1949 | Uncertainty assigned by TRC = 4. K; TRC |
Reduced pressure boiling point
Tboil (K) | Pressure (bar) | Reference | Comment |
---|---|---|---|
430.7 | 0.004 | Aldrich Chemical Company Inc., 1990 | BS |

Gas phase ion energetics data

Data compiled as indicated in comments:
RDSH - Henry M. Rosenstock, Keith Draxl, Bruce W. Steiner, and John T. Herron
Ionization energy determinations
IE (eV) | Method | Reference | Comment |
---|---|---|---|
7.9 ± 0.04 | EI | Bonnier, Gelus, et al., 1965 | RDSH |
Appearance energy determinations
Ion | AE (eV) | Other Products | Method | Reference | Comment |
---|---|---|---|---|---|
C13H9+ | 13.8 ± 0.2 | ? | EI | Nounou, 1966 | RDSH |
C15H9+ | 16.6 ± 0.2 | H2+H | EI | Nounou, 1966 | RDSH |
C15H10+ | 13.1 ± 0.2 | H2 | EI | Nounou, 1966 | RDSH |
C15H11+ | 12.9 ± 0.1 | H | EI | Nounou, 1966 | RDSH |

Kovats' RI, non-polar column, isothermal

View large format table.

Column type Active phase Temperature (C) I Reference Comment
PackedOV-101230.1945.Grimmer and Böhnke, 1975Gas Chrom Q; Column length: 10. m
CapillaryOV-101230.1945.Grimmer and Böhnke, 1972N2; Column length: 50. m; Column diameter: 0.50 mm

Van Den Dool and Kratz RI, non-polar column, temperature ramp

View large format table.

Column type Active phase I Reference Comment
CapillaryOV-11884.0Zhang, Shen, et al., 200025. m/0.2 mm/0.33 μm, 5. K/min; Tstart: 100. C; Tend: 180. C
CapillaryOV-11909.3Zhang, Shen, et al., 200025. m/0.2 mm/0.33 μm, 5. K/min; Tstart: 100. C; Tend: 180. C
CapillarySE-521860.Beernaert, 1979He, 50. C @ 5. min, 6. K/min; Column length: 33.3 m; Column diameter: 0.50 mm; Tend: 320. C

Van Den Dool and Kratz RI, non-polar column, custom temperature program

View large format table.

Column type Active phase I Reference Comment
CapillaryMethyl Silicone1865.Oda, Ichikawa, et al., 1996Program: 50C (2min) => 20C/min => 160C => 5C/min => 210C => 10C/min => 300C

Normal alkane RI, non-polar column, temperature ramp

View large format table.

Column type Active phase I Reference Comment
CapillaryOV-11875.Asif and Fazeelat, 2006Nitrogen, 4. K/min; Column length: 30. m; Column diameter: 0.25 mm; Tstart: 60. C; Tend: 290. C
CapillaryUltra-11875.Elizalde-González, Hutfliess, et al., 199650. m/0.2 mm/0.33 μm, H2, 3. K/min, 300. C @ 35. min; Tstart: 60. C

Normal alkane RI, non-polar column, custom temperature program

View large format table.

Column type Active phase I Reference Comment
PackedOV-1011945.Kaliszan and Lamparczyk, 1978Program: not specified

Normal alkane RI, polar column, temperature ramp

View large format table.

Column type Active phase I Reference Comment
CapillaryTC-Wax2907.Miyazawa and Okuno, 2003He, 4. K/min, 250. C @ 30. min; Column length: 60. m; Column diameter: 0.25 mm; Tstart: 80. C

Lee's RI, non-polar column, temperature ramp

View large format table.

Column type Active phase I Reference Comment
CapillaryDB-5MS319.78Sun, Zhou, et al., 200830. m/0.25 mm/0.25 μm, 50. C @ 2. min, 6. K/min, 300. C @ 16. min
CapillaryHP-5312.3Shao, Wang, et al., 200630. m/0.3 mm/0.25 μm, He, 50. C @ 5. min, 5. K/min, 200. C @ 15. min
Capillary5 % Phenyl methyl siloxane320.17Skrbic and Onjia, 20062. K/min; Tstart: 50. C; Tend: 250. C
Capillary5 % Phenyl methyl siloxane319.50Skrbic and Onjia, 200680. C @ 2. min, 8. K/min, 300. C @ 10. min
CapillaryHP-5319.85Pedersen, Durant, et al., 200530. m/0.25 mm/0.25 μm, Helium, 50. C @ 1.5 min, 6. K/min, 310. C @ 10. min
CapillaryHP-5319.03Marynowski, Pieta, et al., 200460. m/0.25 mm/0.25 μm, He, 3. K/min; Tstart: 35. C; Tend: 300. C
CapillaryDB-5MS319.76Chen, Keeran, et al., 200230. m/0.25 mm/0.5 μm, 40. C @ 1. min, 4. K/min; Tend: 310. C
CapillaryPTE-5320.08Wang, Jia, et al., 200030. m/0.25 mm/0.25 μm, 60. C @ 1.5 min, 8. K/min, 300. C @ 12.5 min
CapillaryHP-5319.48Piao, Chu, et al., 199930. m/0.25 mm/0.25 μm, 50. C @ 2. min, 4. K/min, 280. C @ 20. min
CapillarySE-52320.39Wang, Peng, et al., 19974. K/min; Column length: 30. m; Column diameter: 0.30 mm; Tstart: 40. C; Tend: 250. C
CapillaryDB-5320.34Williams and Horne, 1995He, 60. C @ 2. min, 5. K/min; Column length: 25. m; Column diameter: 0.3 mm; Tend: 270. C
CapillaryDB-5319.99Wang, Fingas, et al., 199430. m/0.32 mm/0.25 μm, He, 50. C @ 2. min, 6. K/min; Tend: 300. C
CapillarySE-54320.08Guillén, Blanco, et al., 198920. m/0.22 mm/0.20 μm, He, 4. K/min; Tstart: 50. C; Tend: 300. C
CapillaryDB-5320.1Palmentier, Britten, et al., 198980. C @ 1. min, 3.5 K/min, 300. C @ 10. min; Column length: 30. m; Column diameter: 0.32 mm
CapillaryDB-5319.76Wise, Benner, et al., 198830. m/0.25 mm/0.25 μm, 40. C @ 2. min, 4. K/min, 280. C @ 5. min
CapillarySE-52319.93Vassilaros, Kong, et al., 198220. m/0.30 mm/0.25 μm, H2, 40. C @ 2. min, 4. K/min; Tend: 265. C
CapillarySE-52320.17Lee, Vassilaros, et al., 197912. m/0.3 mm/0.34 μm, He, 2. K/min; Tstart: 50. C; Tend: 250. C

Lee's RI, non-polar column, custom temperature program

View large format table.

Column type Active phase I Reference Comment
CapillaryDB-5318.5Fuentes, Font, et al., 2007Column length: 60. m; Program: not specified
CapillaryHP-5MS319.67Wang, Li, et al., 200730. m/0.25 mm/0.25 μm, He; Program: 60C(2min) => 6C/min => 258C => 2C/min => 300C(4min)
CapillaryHP-5MS319.67Wang, Li, et al., 2007, 230. m/0.25 mm/0.25 μm, He; Program: not specified
CapillaryHP-5MS319.76Wang, Li, et al., 2007, 230. m/0.25 mm/0.25 μm, He; Program: not specified
CapillaryHP-5MS319.99Wang, Li, et al., 2007, 230. m/0.25 mm/0.25 μm, He; Program: not specified
Capillary5 % Phenyl methyl siloxane316.40Skrbic and Onjia, 2006Program: 70 0C (2 min) 30 0C/min -> 150 0C 5 0C/min -> 200 0C 4 0C/min -> 310 0C (5 min)
CapillaryHP-5MS336.17Cheng, Liu, et al., 200530. m/0.30 mm/0.25 μm, He; Program: 50 0C (2 min) 8 0C/min -> 120 0C (3 min) 10 0C/min -> 230 0C
CapillaryLM-5319.31Ré-Poppi and Santiago-Silva, 200530. m/0.25 mm/0.25 μm, He; Program: 60C(2min) => 15C/min => 180C => 5C/min => 280C (10min)
CapillaryUltra-1316.4Sremac, Skrbic, et al., 200550. m/0.32 mm/0.50 μm, Nitrogen; Program: 40-100 0C 3-15 0C/min -> 290 0C
CapillaryUltra-1319.5Sremac, Skrbic, et al., 200550. m/0.32 mm/0.50 μm, Nitrogen; Program: 40-100 0C 3-15 0C/min -> 290 0C
CapillaryUltra-1320.2Sremac, Skrbic, et al., 200550. m/0.32 mm/0.50 μm, Nitrogen; Program: 40-100 0C 3-15 0C/min -> 290 0C
CapillaryDB-5319.5Lundstedt, Haglund, et al., 200330. m/0.25 mm/0.25 μm; Program: not specified
CapillarySE-52320.97Wang, Peng, et al., 1997Column length: 30. m; Column diameter: 0.30 mm; Program: not specified
CapillaryDB-5319.13Zamperlini, Silva, et al., 199730. m/0.25 mm/0.25 μm, He; Program: 90C (1min) => 10C/min => 120C => 4C/min => 310C (20min)
CapillaryDB-5316.4Takada, Onda, et al., 1990He; Program: 70C(2min) => 30C/min => 150C => 5C/min => 200C => 4C/min => 310C
CapillaryDB-5320.17Naikwadi, Charbonneau, et al., 1987Column length: 30. m; Column diameter: 0.32 mm; Program: not specified
CapillaryDB-5320.25Naikwadi, Charbonneau, et al., 1987Column length: 30. m; Column diameter: 0.32 mm; Program: not specified
CapillaryOV-101320.3Tucminen, Wickstrom, et al., 1986Program: not specified
CapillarySE-52321.28Shlyakhov, 1984Program: not specified

References

Colonge and Kehlstadt, 1955
Colonge, J.; Kehlstadt, J.P.,
Condensation of Cyclic Ketones with 2-Methyl-1-butene-3-one II. Hydropheanthrene and Hydrobiphenyl Series,
Bull. Soc. Chim. Fr., 1955, 1955, 504. [all data]
Adkins and Davis, 1949
Adkins, H.; Davis, J.W.,
Catalytic Dehydrogenation of Hydroaromatic Compounds in Benzene II.,
J. Am. Chem. Soc., 1949, 71, 2955. [all data]
Tatevosyan and Vardanyan, 1949
Tatevosyan, G.T.; Vardanyan, A.G.,
Polycyclic Hydroaromatic Ketones II. 3-Keto-7-methyl-1,2,3,9,10,1a-hexahydrophenanthrene,
Zh. Obshch. Khim., 1949, 19, 327. [all data]
Aldrich Chemical Company Inc., 1990
Aldrich Chemical Company Inc.,
Catalog Handbook of Fine Chemicals, Aldrich Chemical Company, Inc., Milwaukee WI, 1990, 1. [all data]