3-Buten-2-ol, 4-(2,6,6-trimethyl-2-cyclohexen-1-yl)-, (3E)-
- Formula: C13H22O
- Molecular weight: 194.3132
- IUPAC Standard InChIKey: PWDOJWCZWKWKSE-BQYQJAHWSA-N
- CAS Registry Number: 25312-34-9
- Chemical structure:
View 3d structure (requires JavaScript / HTML 5) - Other names: α-Ionol; 4-(2,6,6-Trimethyl-2-cyclohexen-1-yl)-trans-3-buten-2-ol; alpha-lonol; 4-(2,6,6-Trimethyl-2-cyclohexenyl)-3-buten-2-ol, (3E)-; (E)-α-Ionol; 4-(2,6,6-trimethyl-2-cyclohexen-1-yl)-3-buten-2-ol (α-ionol); 4-(2,6,6-Trimethyl)-2-cyclohexen-1-yl-3-buten-2-ol

Van Den Dool and Kratz RI, polar column, temperature ramp

Column type | Active phase | I | Reference | Comment |
---|---|---|---|---|
Capillary | CP-Wax 58CB | 1868. | Pabst, Barron, et al., 1991 | 30. m/0.25 mm/0.22 μm, He, 3. K/min; Tstart: 40. C; Tend: 220. C |

Van Den Dool and Kratz RI, polar column, custom temperature program

Column type | Active phase | I | Reference | Comment |
---|---|---|---|---|
Capillary | Stabilwax | 1923. | Klesk, Qian, et al., 2004 | 30. m/0.32 mm/1. μm, He; Program: 40C (2min) => 5C/min => 100C => 4C/min => 230C (10min) |

Normal alkane RI, non-polar column, custom temperature program

Column type | Active phase | I | Reference | Comment |
---|---|---|---|---|
Capillary | Polydimethyl siloxane with 5 % Ph groups | 1376. | Robinson, Adams, et al., 2012 | Program: not specified |
Capillary | Polydimethyl siloxane with 5 % Ph groups | 1387. | Robinson, Adams, et al., 2012 | Program: not specified |
Capillary | Siloxane, 5 % Ph | 1392. | VOC BinBase, 2012 | Program: not specified |
Capillary | Polydimethyl siloxane, 5 % phenyl | 1392. | Skogerson, Wohlgemuth, et al., 2011 | Program: not specified |

Normal alkane RI, polar column, temperature ramp

Column type | Active phase | I | Reference | Comment |
---|---|---|---|---|
Capillary | PEG-20M | 1886. | Ding, Deng, et al., 1998 | 2. K/min; Column length: 25. m; Column diameter: 0.25 mm; Tstart: 50. C; Tend: 230. C |

Normal alkane RI, polar column, custom temperature program

Column type | Active phase | I | Reference | Comment |
---|---|---|---|---|
Capillary | BP-20 | 1904. | Pontes, Marques, et al., 2007 | 30. m/0.25 mm/0.25 μm, He; Program: 50C(1min) => 2.5C/min => 100C => 2C/min => 180C => 15C/min => 220C |
Capillary | BP-20 | 1902. | Pontes, Marques, et al., 2007 | 30. m/0.25 mm/0.25 μm, He; Program: 50C(1min) => 2.5C/min => 100C => 2C/min => 180C => 15C/min => 220C |
Capillary | PEG-20M | 1888. | Ding, Deng, et al., 1998 | Column length: 25. m; Column diameter: 0.25 mm; Program: not specified |

References

Pabst, Barron, et al., 1991
Pabst, A.; Barron, D.; Etiévant, P.; Schreier, P.,
Studies on the enzymatic hydrolysis of bound aroma constituents from raspberry fruit pulp,
J. Agric. Food Chem., 1991, 39, 1, 173-175, https://doi.org/10.1021/jf00001a034
. [all data]
Klesk, Qian, et al., 2004
Klesk, K.; Qian, M.; Martin, R.R.,
Aroma extract dilution analysis of cv. meeker (Rubus idaeus L.) red raspberries from Oregon and Washington,
J. Agric. Food Chem., 2004, 52, 16, 5155-5161, https://doi.org/10.1021/jf0498721
. [all data]
Robinson, Adams, et al., 2012
Robinson, A.L.; Adams, D.O.; Boss, P.K.; Heymann, H.; Solomon, P.S.; Trengove, R.D.,
Influence of geographic origine on the sensory characteristics and wine composition of Vitus viniferas cv. Cabernet Sauvignon wines from Australia (Supplemental data),
Am. J. Enol. Vitic., 2012, 64, 4, 467-476, https://doi.org/10.5344/ajev.2012.12023
. [all data]
VOC BinBase, 2012
VOC BinBase,
The volatile compound BinBase (VOC BinBase), 2012, retrieved from http://fiehnlab.ucdavis.edu/projects/VocBinBase and http://binbase.sourceforge.net. [all data]
Skogerson, Wohlgemuth, et al., 2011
Skogerson, K.; Wohlgemuth, G.; Fiehn, O.,
VocBinNase, 2011, retrieved from http://fiehnlab.ucdavis.edu/projects//VocBinBase. [all data]
Ding, Deng, et al., 1998
Ding, Q.; Deng, Y.; Sun, Y.; Huagn, A.; Sun, Y.,
Analysis of volatile components in ox feces by capillary gas chromatography,
Beijing Daxue Xuebao Ziran Kexueban, 1998, 34, 6, 720-725. [all data]
Pontes, Marques, et al., 2007
Pontes, M.; Marques, J.C.; Camara, J.S.,
Screening of volatile composition from Portuguese multifloral honeys using headspace solid-phase microextraction-gas chromatography-quadrupole mass spectrometry,
Talanta, 2007, 74, 1, 91-103, https://doi.org/10.1016/j.talanta.2007.05.037
. [all data]