2,3,6-Trimethylbenzoic acid
- Formula: C10H12O2
- Molecular weight: 164.2011
- IUPAC Standard InChIKey: JRUKSSBDIZXQDX-UHFFFAOYSA-N
- CAS Registry Number: 2529-36-4
- Chemical structure:
View 3d structure (requires JavaScript / HTML 5) - Permanent link for this species. Use this link for bookmarking this species for future reference.

Phase change data

Data compiled as indicated in comments:
ALS - Hussein Y. Afeefy, Joel F. Liebman, and Stephen E. Stein
DRB - Donald R. Burgess, Jr.
AC - William E. Acree, Jr., James S. Chickos
Quantity | Value | Units | Method | Reference | Comment |
---|---|---|---|---|---|
ΔsubH° | 24.95 ± 0.05 | kcal/mol | V | Colomina, Jimenez, et al., 1987 | see Colomina, Turrion, et al., 1964 and Colomina, Perez-Ossorio, et al., 1960; ALS |
ΔsubH° | 24.95 | kcal/mol | N/A | Colomina, Jimenez, et al., 1987 | DRB |
ΔsubH° | 24.95 ± 0.05 | kcal/mol | ME | Colomina, Jimenez, et al., 1987 | Based on data from 314. to 336. K.; AC |
Enthalpy of sublimation
ΔsubH (kcal/mol) | Temperature (K) | Method | Reference | Comment |
---|---|---|---|---|
24.76 ± 0.05 | 325. | ME | Colomina, Jimenez, et al., 1987 | Based on data from 314. to 336. K.; AC |

Condensed phase thermochemistry data

Data compiled by: Hussein Y. Afeefy, Joel F. Liebman, and Stephen E. Stein
Quantity | Value | Units | Method | Reference | Comment |
---|---|---|---|---|---|
ΔfH°solid | -113.7 ± 0.45 | kcal/mol | Cm | Colomina, Jimenez, et al., 1987 | see Colomina, Turrion, et al., 1964 and Colomina, Perez-Ossorio, et al., 1960 |
Quantity | Value | Units | Method | Reference | Comment |
ΔcH°solid | -1236.74 ± 0.20 | kcal/mol | Cm | Colomina, Jimenez, et al., 1987 | see Colomina, Turrion, et al., 1964 and Colomina, Perez-Ossorio, et al., 1960; Corresponding ΔfHºsolid = -113.66 kcal/mol (simple calculation by NIST; no Washburn corrections) |

Gas phase ion energetics data

Data compiled by: John E. Bartmess
De-protonation reactions
C10H11O2- + =
By formula: C10H11O2- + H+ = C10H12O2
Quantity | Value | Units | Method | Reference | Comment |
---|---|---|---|---|---|
ΔrG° | 330.7 ± 2.1 | kcal/mol | IMRE | Decouzon, Gal, et al., 1997 | gas phase |

Reaction thermochemistry data

Data compiled by: John E. Bartmess
Individual Reactions
C10H11O2- + =
By formula: C10H11O2- + H+ = C10H12O2
Quantity | Value | Units | Method | Reference | Comment |
---|---|---|---|---|---|
ΔrG° | 330.7 ± 2.1 | kcal/mol | IMRE | Decouzon, Gal, et al., 1997 | gas phase |

References

Colomina, Jimenez, et al., 1987
Colomina, M.; Jimenez, P.; Roux, M.V.; Turrion, C.,
Thermochemical properties of benzoic acid derivatives. XV. Vapour pressures and enthalpies of sublimation and formation of the six trimethylbenzoic acids,
J. Chem. Thermodyn., 1987, 19, 1139-1144. [all data]
Colomina, Turrion, et al., 1964
Colomina, M.; Turrion, C.; Boned, M.L.; Panea, M.,
Investigaciones termoquimicas sobre los acidos alquilbenzoicos. III. Acidos trimetilbenzoicos,
Anal. Fisc. Quim. B, 1964, 60, 619-626. [all data]
Colomina, Perez-Ossorio, et al., 1960
Colomina, M.; Perez-Ossorio, R.; Boned, M.L.; Panea, M.; Turrion, C.,
Thermochemical investigations on methylsubstituted benzoic acid, Rpt. for the US. Dept. of the Army, European Research Office contract no. DA-91-591-EUC-1364-OI-4291-60 by Instituto de Quimica Fisica Madrid, Spain, 1960, 1-38. [all data]