trans 3,3,3-trifluoro-N,N-bis(trifluoromethyl)propenylamine

Phase change data

Data compiled by: William E. Acree, Jr., James S. Chickos

Enthalpy of vaporization

ΔvapH (kcal/mol) Temperature (K) Method Reference Comment
6.74302.AStephenson and Malanowski, 1987Based on data from 287. - 319. K. See also Haszeldine and Tipping, 1968.

References

Stephenson and Malanowski, 1987
Stephenson, Richard M.; Malanowski, Stanislaw, Handbook of the Thermodynamics of Organic Compounds, 1987, https://doi.org/10.1007/978-94-009-3173-2 . [all data]

Haszeldine and Tipping, 1968
Haszeldine, R.N.; Tipping, A.E., Perfluoroalkyl derivatives of nitrogen. Part XXVI. The preparation and rearrangement of polyfluorovinylamines and of trifluoromethyl trifluorovinyl ether, J. Chem. Soc., C, 1968, 398, https://doi.org/10.1039/j39680000398 . [all data]