Poly-ε-caprolactone

Condensed phase thermochemistry data

Data compiled by: Eugene S. Domalski and Elizabeth D. Hearing

Quantity Value Units Method Reference Comment
solid,1 bar181.7J/mol*KN/ALebedev, Yevstropov, et al., 1978

Constant pressure heat capacity of solid

Cp,solid (J/mol*K) Temperature (K) Reference Comment
161.6298.15Lebedev, Yevstropov, et al., 1978T = 13.8 to 350 K.

References

Lebedev, Yevstropov, et al., 1978
Lebedev, B.V.; Yevstropov, A.A.; Lebedev, N.K.; Karpova, Ye.A.; Lyudvig, Ye.B.; Belen'kaya, B.G., The thermodynamics of e-caprolactone, its polymer and of e-caprolactone polymerization in the 0-350°K range, Vysokomol. Soedin., 1978, A20, 1974-1980. [all data]