2,4,6-Trinitropyridine 1-oxide
- Formula: C5H2N4O7
- Molecular weight: 230.0920
- IUPAC Standard InChIKey: DQQZMAWSHWQSSF-UHFFFAOYSA-N
- CAS Registry Number: 25242-76-6
- Chemical structure:
View 3d structure (requires JavaScript / HTML 5) - Permanent link for this species. Use this link for bookmarking this species for future reference.

Condensed phase thermochemistry data

Data compiled by: Hussein Y. Afeefy, Joel F. Liebman, and Stephen E. Stein
Quantity | Value | Units | Method | Reference | Comment |
---|---|---|---|---|---|
ΔfH°solid | 102.1 ± 1.3 | kJ/mol | Ccb | Lebedev, Chironov, et al., 1995 | |
Quantity | Value | Units | Method | Reference | Comment |
ΔcH°solid | -2355.6 ± 1.3 | kJ/mol | Ccb | Lebedev, Chironov, et al., 1995 |

Phase change data

Data compiled as indicated in comments:
ALS - Hussein Y. Afeefy, Joel F. Liebman, and Stephen E. Stein
AC - William E. Acree, Jr., James S. Chickos
Quantity | Value | Units | Method | Reference | Comment |
---|---|---|---|---|---|
ΔsubH° | 106.3 ± 2.9 | kJ/mol | V | Lebedev, Chironov, et al., 1995 | ALS |
Enthalpy of sublimation
ΔsubH (kJ/mol) | Temperature (K) | Reference | Comment |
---|---|---|---|
106.3 ± 2.9 | 377. to 403. | Lebedev, Chironov, et al., 1995, 2 | AC |

References

Lebedev, Chironov, et al., 1995
Lebedev, V.P.; Chironov, V.V.; Kizin, A.N.; Falyahov, I.F.; Saifullin, I.Sh.; Klyuchnikov, O.R.; Orlov, Yu.D.; Lebedev, Yu.A.,
The energies of dissociation of the N-O bonds in pyridine 1-oxide deriveates,
Russ. Chem. Bull. (Engl. Transl.), 1995, 44, 639-641. [all data]
Lebedev, Chironov, et al., 1995, 2
Lebedev, V.P.; Chironov, V.V.; Kizin, A.N.; Falyakhov, I.F.; Saifullin, I.Sh.; Klyushnikov, O.R.; Orlov, Yu.D.; Lebedev, Yu.A.,
Dissociation energy of the N-O bond in pyridine 1-oxide derivatives,
Izv. Akad. Nauk Ser. Khim., 1995, 4, 660. [all data]