9H-Fluorene, 3-methyl-
- Formula: C14H12
- Molecular weight: 180.2451
- IUPAC Standard InChIKey: GVSRMRNALQEEEI-UHFFFAOYSA-N
- CAS Registry Number: 2523-39-9
- Chemical structure:
View 3d structure (requires JavaScript / HTML 5) - Other names: 3-Methylfluorene; 3-Methyl-9H-fluorene

Van Den Dool and Kratz RI, non-polar column, temperature ramp

Column type | Active phase | I | Reference | Comment |
---|---|---|---|---|
Capillary | OV-1 | 1698.2 | Zhang, Shen, et al., 2000 | 25. m/0.2 mm/0.33 μm, 5. K/min; Tstart: 100. C; Tend: 180. C |
Capillary | OV-1 | 1718.8 | Zhang, Shen, et al., 2000 | 25. m/0.2 mm/0.33 μm, 5. K/min; Tstart: 100. C; Tend: 180. C |

Normal alkane RI, non-polar column, isothermal

Column type | Active phase | Temperature (C) | I | Reference | Comment |
---|---|---|---|---|---|
Packed | Polydimethyl siloxane | 183. | 1690. | Ferrand, 1962 |

Lee's RI, non-polar column, custom temperature program

Column type | Active phase | I | Reference | Comment |
---|---|---|---|---|
Capillary | DB-5MS | 286.9 | Aracil, Font, et al., 2005 | Column length: 60. m; Column diameter: 0.25 mm; Program: not specified |
Capillary | DB-5MS | 293. | Aracil, Font, et al., 2005 | Column length: 60. m; Column diameter: 0.25 mm; Program: not specified |

References

Zhang, Shen, et al., 2000
Zhang, M.-J.; Shen, S.-D.; Chen, S.-Y.; Sun, Y.-H.,
Analysis of heavy oil fractions in high-temperature coal tar by capillary gas chromatography/fourier transform infrared spectrometry,
Chin. J. Chromatogr., 2000, 18, 3, 241-246. [all data]
Ferrand, 1962
Ferrand, R.,
Gas phase chromatography using retention indices for the analysis of tars and their hydrogenation products,
Journees internationales d'etude des methodes de separation immediate at de chromatographie; Org. sur l'initiative du IX., 1962, 132-140. [all data]
Aracil, Font, et al., 2005
Aracil, I.; Font, R.; Conesa, J.A.,
Semivolatile and volatile compounds from the pyrolysis and combustion of polyvinyl chloride,
J. Anal. Appl. Pyrolysis, 2005, 74, 1-2, 465-478, https://doi.org/10.1016/j.jaap.2004.09.008
. [all data]