9H-Fluorene, 9-methyl-
- Formula: C14H12
- Molecular weight: 180.2451
- IUPAC Standard InChIKey: ZVEJRZRAUYJYCO-UHFFFAOYSA-N
- CAS Registry Number: 2523-37-7
- Chemical structure:
View 3d structure (requires JavaScript / HTML 5) - Other names: Fluorene, 9-methyl-; 9-Methylfluorene; 9-Methyl-9H-fluorene

Gas phase thermochemistry data

Data compiled by: Hussein Y. Afeefy, Joel F. Liebman, and Stephen E. Stein
Quantity | Value | Units | Method | Reference | Comment |
---|---|---|---|---|---|
ΔfH°gas | 148.0 ± 1.1 | kJ/mol | Ccr | Rakus, Verevkin, et al., 1994 |

Reaction thermochemistry data

Data compiled by: John E. Bartmess
Individual Reactions
C14H11- + =
By formula: C14H11- + H+ = C14H12
Quantity | Value | Units | Method | Reference | Comment |
---|---|---|---|---|---|
ΔrH° | 1468. ± 8.8 | kJ/mol | G+TS | Taft, 1987 | gas phase; value altered from reference due to change in acidity scale |
Quantity | Value | Units | Method | Reference | Comment |
ΔrG° | 1437. ± 8.4 | kJ/mol | IMRE | Taft, 1987 | gas phase; value altered from reference due to change in acidity scale |

Van Den Dool and Kratz RI, non-polar column, temperature ramp

Column type | Active phase | I | Reference | Comment |
---|---|---|---|---|
Capillary | SE-52 | 1579. | Beernaert, 1979 | He, 50. C @ 5. min, 6. K/min; Column length: 33.3 m; Column diameter: 0.50 mm; Tend: 320. C |

Normal alkane RI, non-polar column, isothermal

Column type | Active phase | Temperature (C) | I | Reference | Comment |
---|---|---|---|---|---|
Packed | Polydimethyl siloxane | 183. | 1600. | Ferrand, 1962 |

Normal alkane RI, non-polar column, temperature ramp

Column type | Active phase | I | Reference | Comment |
---|---|---|---|---|
Capillary | Ultra-1 | 1579. | Elizalde-González, Hutfliess, et al., 1996 | 50. m/0.2 mm/0.33 μm, H2, 3. K/min, 300. C @ 35. min; Tstart: 60. C |

Normal alkane RI, polar column, custom temperature program

Column type | Active phase | I | Reference | Comment |
---|---|---|---|---|
Capillary | SOLGel-Wax | 2466. | Shu and Shen, 2008 | 30. m/0.53 mm/0.50 μm, Helium; Program: 40 0C 7 0C/min -> 180 0C 10 0C/min -> 240 0C (10 min) |
Capillary | SOLGel-Wax | 2466. | Shu and Shen, 2008 | 30. m/0.53 mm/0.50 μm, Helium; Program: not specified |

Lee's RI, non-polar column, temperature ramp

Column type | Active phase | I | Reference | Comment |
---|---|---|---|---|
Capillary | HP-5 | 273.49 | Piao, Chu, et al., 1999 | 30. m/0.25 mm/0.25 μm, 50. C @ 2. min, 4. K/min, 280. C @ 20. min |
Capillary | DB-5 | 272.9 | Durlak, Biswas, et al., 1998 | 30. m/0.25 mm/0.25 μm, 15. K/min; Tstart: 50. C; Tend: 300. C |
Capillary | SE-52 | 272.51 | Wang, Peng, et al., 1997 | 4. K/min; Column length: 30. m; Column diameter: 0.30 mm; Tstart: 40. C; Tend: 250. C |
Capillary | CP Sil 8 CB | 273.9 | Bundt, Herbel, et al., 1991 | 50. m/0.25 mm/0.25 μm, He, 4. K/min; Tstart: 80. C; Tend: 300. C |
Capillary | SE-52 | 273.79 | Vassilaros, Kong, et al., 1982 | 20. m/0.30 mm/0.25 μm, H2, 40. C @ 2. min, 4. K/min; Tend: 265. C |
Capillary | SE-52 | 272.38 | Lee, Vassilaros, et al., 1979 | 12. m/0.3 mm/0.34 μm, He, 2. K/min; Tstart: 50. C; Tend: 250. C |

Lee's RI, non-polar column, custom temperature program

Column type | Active phase | I | Reference | Comment |
---|---|---|---|---|
Capillary | DB-5 | 273.9 | Fuentes, Font, et al., 2007 | Column length: 60. m; Program: not specified |
Capillary | DB-5MS | 271.5 | Aracil, Font, et al., 2005 | Column length: 60. m; Column diameter: 0.25 mm; Program: not specified |
Capillary | SE-52 | 272.38 | Wang, Peng, et al., 1997 | Column length: 30. m; Column diameter: 0.30 mm; Program: not specified |
Capillary | CP Sil 8 CB | 273.5 | Bundt, Herbel, et al., 1991 | 50. m/0.25 mm/0.25 μm, He; Program: not specified |
Capillary | CP Sil 8 CB | 273.8 | Bundt, Herbel, et al., 1991 | 50. m/0.25 mm/0.25 μm, He; Program: not specified |
Capillary | DB-5 | 271.72 | Naikwadi, Charbonneau, et al., 1987 | Column length: 30. m; Column diameter: 0.32 mm; Program: not specified |
Capillary | DB-5 | 272.38 | Naikwadi, Charbonneau, et al., 1987 | Column length: 30. m; Column diameter: 0.32 mm; Program: not specified |
Capillary | SE-52 | 271.40 | Shlyakhov, 1984 | Program: not specified |
Capillary | SE-52 | 272.38 | Shlyakhov, 1984 | Program: not specified |

Condensed phase thermochemistry data

Data compiled by: Hussein Y. Afeefy, Joel F. Liebman, and Stephen E. Stein
Quantity | Value | Units | Method | Reference | Comment |
---|---|---|---|---|---|
ΔfH°solid | 65.3 ± 1.0 | kJ/mol | Ccr | Rakus, Verevkin, et al., 1994 | crystal phase |
Quantity | Value | Units | Method | Reference | Comment |
ΔcH°solid | -7289.36 | kJ/mol | Ccr | Rakus, Verevkin, et al., 1994 | crystal phase; Corresponding ΔfHºsolid = 65.24 kJ/mol (simple calculation by NIST; no Washburn corrections) |

Phase change data

Data compiled as indicated in comments:
BS - Robert L. Brown and Stephen E. Stein
AC - William E. Acree, Jr., James S. Chickos
ALS - Hussein Y. Afeefy, Joel F. Liebman, and Stephen E. Stein
DRB - Donald R. Burgess, Jr.
Quantity | Value | Units | Method | Reference | Comment |
---|---|---|---|---|---|
ΔvapH° | 70.6 ± 0.3 | kJ/mol | GS | Verevkin, 2004 | Based on data from 320. to 353. K.; AC |
ΔvapH° | 71.3 ± 0.2 | kJ/mol | GS | Verevkin, 2004 | Based on data from 318. to 358. K.; AC |
ΔvapH° | 66.5 | kJ/mol | B | Rakus, Verevkin, et al., 1994 | Based on data from 318. to 358. K.; AC |
Quantity | Value | Units | Method | Reference | Comment |
ΔsubH° | 83.7 ± 0.6 | kJ/mol | GS | Verevkin, 2004 | Based on data from 285. to 317. K.; AC |
ΔsubH° | 82.77 | kJ/mol | V | Rakus, Verevkin, et al., 1994 | crystal phase; ALS |
ΔsubH° | 82.7 | kJ/mol | N/A | Rakus, Verevkin, et al., 1994 | DRB |
ΔsubH° | 82.8 ± 0.3 | kJ/mol | N/A | Rakus, Verevkin, et al., 1994 | AC |
Reduced pressure boiling point
Tboil (K) | Pressure (bar) | Reference | Comment |
---|---|---|---|
428.2 | 0.020 | Weast and Grasselli, 1989 | BS |
Enthalpy of sublimation
ΔsubH (kJ/mol) | Temperature (K) | Method | Reference | Comment |
---|---|---|---|---|
82.8 ± 0.3 | 338. | B | Rakus, Verevkin, et al., 1994 | Based on data from 318. to 358. K.; AC |
Enthalpy of fusion
ΔfusH (kJ/mol) | Temperature (K) | Method | Reference | Comment |
---|---|---|---|---|
16.32 | 319.2 | DSC | Rakus, Verevkin, et al., 1994 | AC |

Gas phase ion energetics data

Data compiled by: John E. Bartmess
De-protonation reactions
C14H11- + =
By formula: C14H11- + H+ = C14H12
Quantity | Value | Units | Method | Reference | Comment |
---|---|---|---|---|---|
ΔrH° | 1468. ± 8.8 | kJ/mol | G+TS | Taft, 1987 | gas phase; value altered from reference due to change in acidity scale |
Quantity | Value | Units | Method | Reference | Comment |
ΔrG° | 1437. ± 8.4 | kJ/mol | IMRE | Taft, 1987 | gas phase; value altered from reference due to change in acidity scale |

References

Rakus, Verevkin, et al., 1994
Rakus, K.; Verevkin, S.P.; Schatzer, J.; Beckhaus, H.-D.; Ruchardt, C.,
Thermochemistry and thermal decomposition of 9,9'-bifluorenyl and 9,9'-dimethyl-9,9'-bifluorenyl - the stabilization energy of 9-fluorenyl radicals,
Chem. Ber., 1994, 127, 1095-1103. [all data]
Taft, 1987
Taft, R.W.,
The Nature and Analysis of Substitutent Electronic Effects,
Personal communication. See also Prog. Phys. Org. Chem., 1987, 16, 1. [all data]
Beernaert, 1979
Beernaert, H.,
Gas Chromatographic Analysis of Polyclylic Aromatic Hydrocarbons,
J. Chromatogr., 1979, 173, 1, 109-118, https://doi.org/10.1016/S0021-9673(01)80450-7
. [all data]
Ferrand, 1962
Ferrand, R.,
Gas phase chromatography using retention indices for the analysis of tars and their hydrogenation products,
Journees internationales d'etude des methodes de separation immediate at de chromatographie; Org. sur l'initiative du IX., 1962, 132-140. [all data]
Elizalde-González, Hutfliess, et al., 1996
Elizalde-González, M.P.; Hutfliess, M.; Hedden, K.,
Retention index system, adsorption characteristics, and sructure correlations of polycyclic aromatic hydrocarbons in fuels,
J. Hi. Res. Chromatogr., 1996, 19, 6, 345-352, https://doi.org/10.1002/jhrc.1240190608
. [all data]
Shu and Shen, 2008
Shu, N.; Shen, H.,
Aroma-impact compounds in Lysimachia foenum-graecum extracts,
Flavour Fragr. J., 2008, 24, 1, 1-6, https://doi.org/10.1002/ffj.1908
. [all data]
Piao, Chu, et al., 1999
Piao, M.; Chu, S.; Zheng, M.; Xu, X.,
Characterization of the combustion products of polyethylene,
Chemosphere, 1999, 39, 9, 1497-1512, https://doi.org/10.1016/S0045-6535(99)00054-5
. [all data]
Durlak, Biswas, et al., 1998
Durlak, S.K.; Biswas, P.; Shi, J.; Bernhard, M.J.,
Characterization of polycyclic aromatic hydrocarbon particulate and gaseous emissions from polystyrene combustion,
Environ. Sci. Technol., 1998, 32, 15, 2301-2307, https://doi.org/10.1021/es9709031
. [all data]
Wang, Peng, et al., 1997
Wang, Y.; Peng, P.; Cui, S.; Zhang, Y.,
Identification of PAH in the Suzhou River bed sediments by GC/MS and PAH retention index system,
J. Nanjing Norm. Univ. (Nat. Sci.), 1997, 20, 2, 47-68. [all data]
Bundt, Herbel, et al., 1991
Bundt, J.; Herbel, W.; Steinhart, H.; Franke, S.; Francke, W.,
Structure-type separation of diesel fuels by solid phase extraction and identification of the two- and three-ring aromatics by capillary GC-mass spectrometry,
J. Hi. Res. Chromatogr., 1991, 14, 2, 91-98, https://doi.org/10.1002/jhrc.1240140205
. [all data]
Vassilaros, Kong, et al., 1982
Vassilaros, D.L.; Kong, R.C.; Later, D.W.; Lee, M.L.,
Linear retention index system for polycyclic aromatic compounds. Critical evaluation and additional indices,
J. Chromatogr., 1982, 252, 1-20, https://doi.org/10.1016/S0021-9673(01)88394-1
. [all data]
Lee, Vassilaros, et al., 1979
Lee, M.L.; Vassilaros, D.L.; White, C.M.; Novotny, M.,
Retention Indices for Programmed-Temperature Capillary-Column Gas Chromatography of Polycyclic Aromatic Hydrocarbons,
Anal. Chem., 1979, 51, 6, 768-773, https://doi.org/10.1021/ac50042a043
. [all data]
Fuentes, Font, et al., 2007
Fuentes, M.J.; Font, R.; Gomez-Rico, M.F.; Martin-Gullon, I.,
Pyrolysis and combustion of waste lubricant oil from diesel cars: Decomposition and pollutants,
J. Anal. Appl. Pyrolysis, 2007, 79, 1-2, 215-226, https://doi.org/10.1016/j.jaap.2006.12.004
. [all data]
Aracil, Font, et al., 2005
Aracil, I.; Font, R.; Conesa, J.A.,
Semivolatile and volatile compounds from the pyrolysis and combustion of polyvinyl chloride,
J. Anal. Appl. Pyrolysis, 2005, 74, 1-2, 465-478, https://doi.org/10.1016/j.jaap.2004.09.008
. [all data]
Naikwadi, Charbonneau, et al., 1987
Naikwadi, K.P.; Charbonneau, G.M.; Karasek, F.W.; Clement, R.E.,
Separation and Identification of Organic Compounds in Air Particulate Extracts by High-Performance Liquid Chromatography and Gas Chromatography-Mass Spectrometry,
J. Chromatogr., 1987, 398, 227-237, https://doi.org/10.1016/S0021-9673(01)96508-2
. [all data]
Shlyakhov, 1984
Shlyakhov, A.F.,
Gas chromatography in organic geochemistry, Nedra, Moscow, 1984, 221. [all data]