Poly-L-proline

Condensed phase thermochemistry data

Data compiled by: Eugene S. Domalski and Elizabeth D. Hearing

Constant pressure heat capacity of solid

Cp,solid (J/mol*K) Temperature (K) Reference Comment
115.7300.Roles, Xenopoulos, et al., 1993T = 220 to 390 K.
115.7300.Roles, 1991T = 220 to 390 K.

References

Roles, Xenopoulos, et al., 1993
Roles, K.A.; Xenopoulos, A.; Wunderlich, B., Heat capacities of solid poly(amino acid)s. II. The remaining polymers, Bipolymers, 1993, 33(5), 753-768. [all data]

Roles, 1991
Roles, K.A., Heat capacity studies of solid poly(amino acids), Diss. Abstr. Int., 1991, B 52(6), 3095. [all data]