Propanoic acid, 3,3,3-trifluoro-
- Formula: C3H3F3O2
- Molecular weight: 128.0499
- IUPAC Standard InChIKey: KSNKQSPJFRQSEI-UHFFFAOYSA-N
- CAS Registry Number: 2516-99-6
- Chemical structure:
View 3d structure (requires JavaScript / HTML 5) - Other names: 3,3,3-trifluoropropanoic acid

Phase change data

Data compiled by: Thermodynamics Research Center, NIST Boulder Laboratories, Chris Muzny director
Quantity | Value | Units | Method | Reference | Comment |
---|---|---|---|---|---|
Tboil | 418.7 | K | N/A | McBee, Hass, et al., 1950 | Uncertainty assigned by TRC = 2. K |

Gas phase ion energetics data

Data compiled by: John E. Bartmess
De-protonation reactions
C3H2F3O2- + =
By formula: C3H2F3O2- + H+ = C3H3F3O2
Quantity | Value | Units | Method | Reference | Comment |
---|---|---|---|---|---|
ΔrH° | 1397. ± 8.8 | kJ/mol | G+TS | Caldwell, Renneboog, et al., 1989 | gas phase |
ΔrH° | 1400. ± 8.8 | kJ/mol | G+TS | Taft and Topsom, 1987 | gas phase |
Quantity | Value | Units | Method | Reference | Comment |
ΔrG° | 1368. ± 8.4 | kJ/mol | IMRE | Caldwell, Renneboog, et al., 1989 | gas phase |
ΔrG° | 1371. ± 8.4 | kJ/mol | IMRE | Taft and Topsom, 1987 | gas phase |

Reaction thermochemistry data

Data compiled by: John E. Bartmess

Individual Reactions

C3H2F3O2- + Hydrogen cation = Propanoic acid, 3,3,3-trifluoro-

By formula: C3H2F3O2- + H+ = C3H3F3O2

Quantity Value Units Method Reference Comment
Δr1397. ± 8.8kJ/molG+TSCaldwell, Renneboog, et al., 1989gas phase
Δr1400. ± 8.8kJ/molG+TSTaft and Topsom, 1987gas phase
Quantity Value Units Method Reference Comment
Δr1368. ± 8.4kJ/molIMRECaldwell, Renneboog, et al., 1989gas phase
Δr1371. ± 8.4kJ/molIMRETaft and Topsom, 1987gas phase

References

McBee, Hass, et al., 1950
McBee, E.T.; Hass, H.B.; Robinson, I.M.,
Nitration of 1,1,1-Trifluoropropane,
J. Am. Chem. Soc., 1950, 1950, 72. 3579-80. [all data]
Caldwell, Renneboog, et al., 1989
Caldwell, G.; Renneboog, R.; Kebarle, P.,
Gas Phase Acidities of Aliphatic Carboxylic Acids, Based on Measurements of Proton Transfer Equilibria,
Can. J. Chem., 1989, 67, 4, 661, https://doi.org/10.1139/v89-092
. [all data]
Taft and Topsom, 1987
Taft, R.W.; Topsom, R.D.,
The Nature and Analysis of Substituent Effects,
Prog. Phys. Org. Chem., 1987, 16, 1. [all data]