naphthylamine
- Formula: C10H9N
- Molecular weight: 143.1852
- IUPAC Standard InChIKey: RUFPHBVGCFYCNW-UHFFFAOYSA-N
- CAS Registry Number: 25168-10-9
- Chemical structure:
View 3d structure (requires JavaScript / HTML 5) - Species with the same structure:

Phase change data

Data compiled by: Thermodynamics Research Center, NIST Boulder Laboratories, Chris Muzny director
Quantity | Value | Units | Method | Reference | Comment |
---|---|---|---|---|---|
Tfus | 321.3 | K | N/A | Demerliac, 1898 | Uncertainty assigned by TRC = 0.05 K |

References

Demerliac, 1898
Demerliac, M.R.,
J. Phys. Radium, 1898, 7, 591. [all data]