Isopropylphenol
- Formula: C9H12O
- Molecular weight: 136.1910
- CAS Registry Number: 25168-06-3
- Chemical structure:
View 3d structure (requires JavaScript / HTML 5) - Other names: Phenol, (1-methylethyl)-

Reaction thermochemistry data

Data compiled by: Hussein Y. Afeefy, Joel F. Liebman, and Stephen E. Stein
Individual Reactions
By formula: C9H12O + C3F6O = C12H12F6O2
Quantity | Value | Units | Method | Reference | Comment |
---|---|---|---|---|---|
ΔrH° | -56.5 | kJ/mol | Eqk | N/A | liquid phase; solvent: Ethyl acetate; Flourene NMR |

References

No reference data available.