Chlorotoluene
- Formula: C7H7Cl
- Molecular weight: 126.583
- IUPAC Standard InChIKey: IBSQPLPBRSHTTG-UHFFFAOYSA-N
- CAS Registry Number: 25168-05-2
- Chemical structure:
View 3d structure (requires JavaScript / HTML 5) - Species with the same structure:
- Other names: Benzyl chloride

Condensed phase thermochemistry data

Data compiled by: Hussein Y. Afeefy, Joel F. Liebman, and Stephen E. Stein
Quantity | Value | Units | Method | Reference | Comment |
---|---|---|---|---|---|
ΔfH°liquid | Ccb | Schmidlin, 1906 | uncertain value: -83.3 kJ/mol; Undetermine error | ||
Quantity | Value | Units | Method | Reference | Comment |
ΔcH°liquid | Ccb | Schmidlin, 1906 | uncertain value: -3710. kJ/mol; Undetermine error |

Normal alkane RI, non-polar column, temperature ramp

Column type | Active phase | I | Reference | Comment |
---|---|---|---|---|
Capillary | Ultra-ALLOY-5 | 962. | Tsuge, Ohtan, et al., 2011 | 30. m/0.25 mm/0.25 μm, 40. C @ 2. min, 20. K/min, 320. C @ 13. min |

References

Schmidlin, 1906
Schmidlin, M.J.,
Recherches chimiques et thermochimiques sur la constitution des rosanilines,
Ann. Chim. Phys., 1906, 1, 195-256. [all data]
Tsuge, Ohtan, et al., 2011
Tsuge, S.; Ohtan, H.; Watanabe, C.,
Pyrolysis - GC/MS Data Book of Synthetic Polymers, Elsevier, 2011, 420. [all data]