diphenylpropane
- Formula: C15H16
- Molecular weight: 196.2875
- IUPAC Standard InChIKey: VEAFKIYNHVBNIP-UHFFFAOYSA-N
- CAS Registry Number: 25167-94-6
- Chemical structure:
View 3d structure (requires JavaScript / HTML 5) - Species with the same structure:
- Other names: 1,3-diphenylpropane

Phase change data

Data compiled by: Thermodynamics Research Center, NIST Boulder Laboratories, Chris Muzny director
Quantity | Value | Units | Method | Reference | Comment |
---|---|---|---|---|---|
Tboil | 572. ± 5. | K | AVG | N/A | Average of 11 values; Individual data points |
Quantity | Value | Units | Method | Reference | Comment |
Tfus | 252.37 | K | N/A | Serijan and Wise, 1951 | Uncertainty assigned by TRC = 0.2 K |
Tfus | 279. | K | N/A | Sabatier and Murat, 1915 | Uncertainty assigned by TRC = 3. K |

References

Serijan and Wise, 1951
Serijan, K.T.; Wise, P.H.,
Dicylic Hydrocarbons. III. Diphenyl- and Dicyclohexylalkanes through C15,
J. Am. Chem. Soc., 1951, 73, 4766. [all data]
Sabatier and Murat, 1915
Sabatier, P.; Murat, M.,
Ann. Chim. (Paris), 1915, 4, 253. [all data]