2,4-Decadienal, (E,E)-
- Formula: C10H16O
- Molecular weight: 152.2334
- IUPAC Standard InChIKey: JZQKTMZYLHNFPL-BLHCBFLLSA-N
- CAS Registry Number: 25152-84-5
- Chemical structure:
View 3d structure (requires JavaScript / HTML 5) - Stereoisomers:
- Other names: (E,E)-2,4-Decadienal; trans-2, trans-4-Decadienal; trans,trans-2,4-Decadien-1-al; trans,trans-2,4-Decadienal; 2-trans-4-trans-Decadienal; 2,4-trans,trans-Decadienal; (E,E)-2,4-Decanedienal; 2,4-Decadien-1-al, (trans,trans)-; (2E,4E)-2,4-Decadienal; 2E,4E-Decadienal; Deca-2(E),4(E)-dienal; (E)-2,(E)-4-decadienal; (E,E)-2,4-decadien-1-al; (E,E)-Deca-2,4-dienal; (2E,4E)-Deca-2,4-dienal; 2,4-Decadienal, (2E,4E)-; 2,4-(E,E)-Decadienal; (E; E)-2,4-decadienal; 2,4-Decadienal <E,E>; (E,E)-2,4-decadecenal

Phase change data

Data compiled by: Robert L. Brown and Stephen E. Stein
Reduced pressure boiling point
Tboil (K) | Pressure (bar) | Reference |
---|---|---|
388.2 | 0.013 | Aldrich Chemical Company Inc., 1990 |

Van Den Dool and Kratz RI, non-polar column, custom temperature program

Data compiled by: NIST Mass Spectrometry Data Center, William E. Wallace, director

Column type CapillaryCapillaryCapillaryCapillaryCapillary
Active phase HP-5MSDB-5MSDB-5SE-54DB-5MS
Column length (m) 30.30.30.30.30.
Carrier gas HeHe  He
Substrate
Column diameter (mm) 0.250.320.250.320.32
Phase thickness (μm) 0.250.50.250.250.5
Program 60C (1 min) => 5 C/min => 210C => 10 C/min => 280C (15 min)70C => 5C/min => 85C(1min) => 3C/min => 165C => 10C/min => 280C(3min)40C(2min) => 4C/min => 220C => 20C/min => 280C40C(2min) => 6C/min => 150C => 20C/min => 230C50C => 5C/min => 200C => 8C/min => 260C(5min)
I 1326.51330.1315.1318.1322.
ReferenceAndriamaharavo, 2014Varlet, Serot, et al., 2007Sampaio and Nogueira, 2006Schuh and Schieberle, 2006Selli, Rannou, et al., 2006
Comment MSDC-RI MSDC-RI MSDC-RI MSDC-RI MSDC-RI
Column type CapillaryCapillaryCapillaryCapillaryCapillary
Active phase DB-5MSSE-52HP-5DB-5BPX-5
Column length (m) 30.25.50.30.50.
Carrier gas HeH2HeHeHe
Substrate
Column diameter (mm) 0.320.320.20.320.25
Phase thickness (μm) 0.50.430.50.250.25
Program 70C(1min) => 3C/min => 80C(1min) => 5C/min => 150C => 10C/min => 280C (4min)60C(8min) => 3C/min => 180C => 20C/min => 250C(10min)40C(3min) => 10C/min => 60C =3C/min => 150C => 20C/min => 250C (5min)20C => 70C/min => 50C => 4C/min => 180C => 10C/min => 240C(10min)0C (5min) => 40C/min => 40C (2min) => 4C/min => 280C
I 1330.1308.1298.1312.1324.
ReferenceVarlet V., Knockaert C., et al., 2006Frizzo, Lorenzo, et al., 2004Boué, Shih, et al., 2003Lin and Blank, 2003Byrne, Bredie, et al., 2002
Comment MSDC-RI MSDC-RI MSDC-RI MSDC-RI MSDC-RI
Column type CapillaryCapillaryCapillaryCapillaryCapillary
Active phase DB-5DB-5DB-5CP Sil 8 CBDB-5
Column length (m) 30.25.25.60.30.
Carrier gas HeHeHeHeHe
Substrate
Column diameter (mm) 0.320.320.320.250.25
Phase thickness (μm) 0.250.250.250.250.25
Program 40C(1min) => 40C/min => 50C(2min) => 6C/min => 240C35C (2min) => 40C/min => 50C (2min) => 4C/min => 240C (10min)35C (2min) => 40C/min => 50C (2min) => 4C/min => 240C (10min)0C => rapidly => 40C(8min) => 4C/min => 250C(10min)50C (1min) => 5C/min => 100C => 10C/min => 250C (9min)
I 1318.1317.1317.1326.1318.
ReferenceJezussek, Juliano, et al., 2002Kirchhoff and Schieberle, 2002Kirchhoff and Schieberle, 2002Oruna-Concha, Bakker, et al., 2002Beaulieu and Grimm, 2001
Comment MSDC-RI MSDC-RI MSDC-RI MSDC-RI MSDC-RI
Column type CapillaryCapillaryCapillaryCapillaryCapillary
Active phase DB-5SE-54DB-5CP-Sil8DB-5
Column length (m) 30.30.25.60.30.
Carrier gas HeHeHeHeHe
Substrate
Column diameter (mm) 0.320.320.320.250.32
Phase thickness (μm) 0.250.250.250.250.25
Program 20C => 70C/min => 50C => 4C/min => 180C => 10C/min => 240C(10min)20C => 70C/min => 50C => 4C/min => 180C => 10C/min => 240C(10min)35C(2min) => 40C/min => 50C(2min) => 4C/min => 240C(10min)40C(2min) => 4C/min => 200C => 10C/min => 250C (15min)35C(2min) => 40C/min => 60C (2min) => 4C/min => 240C
I 1320.1321.1317.1335.1313.
ReferenceBlank, Lin, et al., 2001Blank, Lin, et al., 2001Kirchhoff and Schieberle, 2001Martin and Ames, 2001Rychlik and Bosset, 2001
Comment MSDC-RI MSDC-RI MSDC-RI MSDC-RI MSDC-RI
Column type CapillaryCapillaryCapillaryCapillaryCapillary
Active phase CP-Sil 8CB-MSDB-5DB-5DB-5SE-54
Column length (m) 60.30.30.50.30.
Carrier gas He  HeHe
Substrate
Column diameter (mm) 0.250.320.320.320.32
Phase thickness (μm) 0.250.250.250.50.25
Program 0C(5min) => 40C/min => 40C (2min) => 4C/min => 280C40C(2min) => 40C/min => 50C (1min) => 6C/min => 180C => 10C/min => 240C (5min)40C(2min) => 40C/min => 50C (1min) => 6C/min => 180C => 10C/min => 240C (5min)oC(5min) => 60C/min => 60C (5min) => 4C/min => 250C35C (2min) => 40C/min => 60C (2min) => 6C/min => 180C (5min) => 10C/min => 230C (5min)
I 1327.1316.1317.1338.1319.
ReferenceElmore, Mottram, et al., 2000Munk, Munch, et al., 2000Munk, Munch, et al., 2000Parker, Hassell, et al., 2000Tairu, Hofmann, et al., 2000
Comment MSDC-RI MSDC-RI MSDC-RI MSDC-RI MSDC-RI
Column type CapillaryCapillaryCapillaryCapillaryCapillary
Active phase SE-54SE-54BPX-5SE-54SE-54
Column length (m) 30.30.50.60.25.
Carrier gas HeHeHeHeHe
Substrate
Column diameter (mm) 0.250.320.320.320.32
Phase thickness (μm) 0.250.250.50.250.5
Program 35C(2min) => 40C/min => 60C => 6C/min => 180C 20C/min => 240C(10min)35C (2min) => 40C/min => 50C => 4C/min => 230C (10min)0C(5min) => 40C/min => 40C(2min) => 4C/min => 280C40C(2min) => 5C/min => 70C(2min) => 6C/min => 250C(10min)35C (2min) => 4C/min => 150C => 10C/min => 240C
I 1308.1314.1332.1318.1311.
ReferenceZimmermann and Schieberle, 2000Derail, Hofmann, et al., 1999Elmore, Mottram, et al., 1999Mutti and Grosch, 1999Fickert and Schieberle, 1998
Comment MSDC-RI MSDC-RI MSDC-RI MSDC-RI MSDC-RI
Column type CapillaryCapillaryCapillaryCapillaryCapillary
Active phase SE-54SE-54SE-54SE-54DB-1
Column length (m) 30. 30.30.15.
Carrier gas He HeHeHe
Substrate
Column diameter (mm) 0.32 0.320.320.32
Phase thickness (μm) 0.25 0.30.3
Program 35C(2min) => 40C/min => 50C(2min) => 6C/min => 180C => 10C/min => 230C(10min)35C (2min) => 40C/min => 50C (1min) => 6C/min => 250C (10min)35C (2min) => 40 C/min => 50C (1min) => 6C/min => 250C35C (2min) => 40 C/min => 50C (1min) => 6C/min => 250Cnot specified
I 1314.1318.1318.1320.1285.
ReferenceHinterholzer and Schieberie, 1998Triqui and Reineccius, 1995Triqui and Reineccius, 1995, 2Triqui and Reineccius, 1995, 2Mikolajczak, Zilkowski, et al., 1984
Comment MSDC-RI MSDC-RI MSDC-RI MSDC-RI MSDC-RI

References

Aldrich Chemical Company Inc., 1990
Aldrich Chemical Company Inc.,
Catalog Handbook of Fine Chemicals, Aldrich Chemical Company, Inc., Milwaukee WI, 1990, 1. [all data]