3-(1-methylethyl)-1-methyl-1,3-cyclopentadiene
- Formula: C9H14
- Molecular weight: 122.2075
- IUPAC Standard InChIKey: RGVMTPQFOKGKAH-UHFFFAOYSA-N
- CAS Registry Number: 25148-02-1
- Chemical structure:
View 3d structure (requires JavaScript / HTML 5) - Permanent link for this species. Use this link for bookmarking this species for future reference.

Phase change data

Data compiled by: Thermodynamics Research Center, NIST Boulder Laboratories, Chris Muzny director
Quantity | Value | Units | Method | Reference | Comment |
---|---|---|---|---|---|
Tboil | 428. | K | N/A | Treibs, 1933 | Uncertainty assigned by TRC = 8. K |

References

Treibs, 1933
Treibs, W.,
Ber. Dtsch. Chem. Ges. A, 1933, 66, 1483. [all data]