Cyclopentanol, 2-methyl-, cis-
- Formula: C6H12O
- Molecular weight: 100.1589
- IUPAC Standard InChIKey: BVIJQMCYYASIFP-NTSWFWBYSA-N
- CAS Registry Number: 25144-05-2
- Chemical structure:
View 3d structure (requires JavaScript / HTML 5) - Stereoisomers:
- Other names: cis-2-Methylcyclopentanol; 2-Methylcyclopentanol, (Z)-; Cyclopentanol, 2-methyl-, (1R,2S)-rel-

Condensed phase thermochemistry data

Data compiled by: Hussein Y. Afeefy, Joel F. Liebman, and Stephen E. Stein
Quantity | Value | Units | Method | Reference | Comment |
---|---|---|---|---|---|
ΔfH°liquid | -344. ± 3. | kJ/mol | Cm | Taft, Levy, et al., 1952 | Heat of formation derived by Cox and Pilcher, 1970 |

Reaction thermochemistry data

Data compiled by: Hussein Y. Afeefy, Joel F. Liebman, and Stephen E. Stein
Individual Reactions
By formula: C6H10 + H2O = C6H12O
Quantity | Value | Units | Method | Reference | Comment |
---|---|---|---|---|---|
ΔrH° | -55.8 ± 1.4 | kJ/mol | Eqk | Taft, Levy, et al., 1952 | gas phase; Reanalyzed by Cox and Pilcher, 1970, Original value = -60.0 ± 1.4 kJ/mol; At 308 °K |

References

Taft, Levy, et al., 1952
Taft, R.W., Jr.; Levy, J.B.; Aaron, D.; Hammett, L.P.,
Rates, equilibrium and temperature coefficients in the reversible hydration of gaseous 1-methylcyclopentene-1 by dilute nitric acid,
J. Am. Chem. Soc., 1952, 74, 4735-47. [all data]
Cox and Pilcher, 1970
Cox, J.D.; Pilcher, G.,
Thermochemistry of Organic and Organometallic Compounds, Academic Press, New York, 1970, 1-636. [all data]