2-Butene, 2-methoxy-, (Z)-
- Formula: C5H10O
- Molecular weight: 86.1323
- IUPAC Standard InChIKey: JWBPCSXRWORRAI-SNAWJCMRSA-N
- CAS Registry Number: 25125-85-3
- Chemical structure:
View 3d structure (requires JavaScript / HTML 5) - Stereoisomers:

Reaction thermochemistry data

Data compiled by: Hussein Y. Afeefy, Joel F. Liebman, and Stephen E. Stein
Individual Reactions
By formula: C5H10O = C5H10O
Quantity | Value | Units | Method | Reference | Comment |
---|---|---|---|---|---|
ΔrH° | 0.11 ± 0.091 | kcal/mol | Eqk | Taskinen, 1974 | liquid phase; solvent: Cyclohexane; GLC |
By formula: C5H10O = C5H10O
Quantity | Value | Units | Method | Reference | Comment |
---|---|---|---|---|---|
ΔrH° | 2.35 ± 0.098 | kcal/mol | Eqk | Taskinen, 1974 | liquid phase; solvent: Cyclohexane; GLC |

References

Taskinen, 1974
Taskinen, E.,
Thermodynamics of vinyl ethers. III. On the relative stabilities of 2-methoxy-1-butene, (E)-2-methoxy-2-butene, and (Z)-2-methoxy-2-butene, and related isomeric compounds,
J. Chem. Thermodyn., 1974, 6, 345-353. [all data]