Cyclopropane, pentyl-
- Formula: C8H16
- Molecular weight: 112.2126
- IUPAC Standard InChIKey: SUBUEDOPXXGMKP-UHFFFAOYSA-N
- CAS Registry Number: 2511-91-3
- Chemical structure:
View 3d structure (requires JavaScript / HTML 5) - Other names: Pentane, 1-cyclopropyl-; Pentylcyclopropane; 1-Cyclopropylpentane

Condensed phase thermochemistry data

Data compiled by: Hussein Y. Afeefy, Joel F. Liebman, and Stephen E. Stein
Quantity | Value | Units | Method | Reference | Comment |
---|---|---|---|---|---|
ΔcH°liquid | -5021. | kJ/mol | Ccb | Slabey and Wise, 1952 | Corresponding ΔfHºliquid = -410. kJ/mol (simple calculation by NIST; no Washburn corrections) |

Phase change data

Data compiled by: Thermodynamics Research Center, NIST Boulder Laboratories, Chris Muzny director
Quantity | Value | Units | Method | Reference | Comment |
---|---|---|---|---|---|
Tboil | 401. | K | N/A | Nefedov, Novitskaya, et al., 1963 | Uncertainty assigned by TRC = 1. K |

Kovats' RI, non-polar column, isothermal

Column type | Active phase | Temperature (C) | I | Reference | Comment |
---|---|---|---|---|---|
Capillary | Squalane | 60. | 812.2 | Schomburg and Dielmann, 1973 | Column length: 100. m; Column diameter: 0.25 mm |
Capillary | Squalane | 80. | 813.4 | Schomburg and Dielmann, 1973 | Column length: 100. m; Column diameter: 0.25 mm |
Capillary | Squalane | 70. | 813. | Schomburg, 1966 |

Normal alkane RI, non-polar column, custom temperature program

Column type | Active phase | I | Reference | Comment |
---|---|---|---|---|
Capillary | Squalane | 812. | Chen, 2008 | Program: not specified |

References

Slabey and Wise, 1952
Slabey, V.A.; Wise, P.H.,
Hydrogenation of 2-cyclopropyl-1- and -2-alkenes. Isolation and Purification of 2-cyclopropylalkanes,
J. Am. Chem. Soc., 1952, 74, 3887-3889. [all data]
Nefedov, Novitskaya, et al., 1963
Nefedov, O.M.; Novitskaya, N.N.; Petrov, A.D.,
Preparation of cyclopropanes by reduction of adducts of dihalocarbenes and olefins,
Dokl. Akad. Nauk SSSR, 1963, 152, 629-32. [all data]
Schomburg and Dielmann, 1973
Schomburg, G.; Dielmann, G.,
Use of retention increments for identification and correlation of saturated and unsaturated cyclopropane hydrocarbons by means of Kovats indices,
Anal. Chem., 1973, 45, 9, 1647-1658, https://doi.org/10.1021/ac60331a021
. [all data]
Schomburg, 1966
Schomburg, G.,
Gaschromatographische Retentionsdaten und struktur chemischer verbindungen. III. Alkylverzweigte und ungesättigte cyclische Kohlenwasserstoffe,
J. Chromatogr., 1966, 23, 18-41, https://doi.org/10.1016/S0021-9673(01)98653-4
. [all data]
Chen, 2008
Chen, H.-F.,
Quantitative prediction of gas chromatography retention indices with support vector machines, radial basis neutral networks and multiple linear regression,
Anal. Chim. Acta, 2008, 609, 1, 24-36, https://doi.org/10.1016/j.aca.2008.01.003
. [all data]