O,S-Diethyl methylphosphonothioate
- Formula: C5H13O2PS
- Molecular weight: 168.194
- IUPAC Standard InChIKey: AIMOGGQLCCAPQJ-UHFFFAOYSA-N
- CAS Registry Number: 2511-10-6
- Chemical structure:
View 3d structure (requires JavaScript / HTML 5) - Other names: Phosphonothioic acid, methyl-, O,S-diethyl ester; O,S-Diethyl methylthiophosphonate; OSDMP; LG 61; Methylphosphonothioic acid O,S-diethyl ester; O-Ethyl S-ethyl methylphosphonothioate; Phosphonothioic acid, methyl, diethyl ester; Phosphonothioic acid, P-methyl-, O,S-diethyl ester; O,S-Diethyl methylphosphonothiolate; Methylthiophosphonic acid, O,S-diethyl ester

Van Den Dool and Kratz RI, non-polar column, temperature ramp

Column type | Active phase | I | Reference | Comment |
---|---|---|---|---|
Capillary | SE-54 | 1174. | Kostiainen, 2000 | 25. m/0.32 mm/0.25 μm, He, 40. C @ 1. min, 10. K/min, 280. C @ 10. min |

Normal alkane RI, non-polar column, temperature ramp

Column type | Active phase | I | Reference | Comment |
---|---|---|---|---|
Capillary | DB-5 | 1139. | Savel'eva, Zenkevich, et al., 2003 | 25. m/0.20 mm/0.33 μm, Helium, 40. C @ 1. min, 5. K/min, 270. C @ 15. min |

Normal alkane RI, non-polar column, custom temperature program

Column type | Active phase | I | Reference | Comment |
---|---|---|---|---|
Capillary | 5 % Phenyl methyl siloxane | 1174. | OPCW, 1997 | Program: not specified |

References

Kostiainen, 2000
Kostiainen, O.,
Gas Chromatography in Screening of Chemicals Related to the Chemical Weapons Convention
in Encyclopedia of Analytical Chemistry, Meyers, R.A., ed(s)., John Wiley Sons Ltd, Chichester, 2000, 963-979. [all data]
Savel'eva, Zenkevich, et al., 2003
Savel'eva, E.I.; Zenkevich, I.G.; Radilov, A.S.,
Identification the Products of Chemical Neutralization of O-Isobutyl-S-(2-diethylaminoethyl)methylthiophosphonate in the Composition of Bitumen-Salt Matrices,
Zh. Anal. Khim. (Rus.), 2003, 58, 2, 135-145. [all data]
OPCW, 1997
OPCW,
Conference of the States Parties C-I/DEC.64 (22 May 1997), 1997, retrieved from http://www.opcw.org/html/global/cseries/csp1/CIDEC64.html. [all data]