9-Cyanophenanthrene
- Formula: C15H9N
- Molecular weight: 203.2387
- IUPAC Standard InChIKey: CWFIYYOQYVYBPW-UHFFFAOYSA-N
- CAS Registry Number: 2510-55-6
- Chemical structure:
View 3d structure (requires JavaScript / HTML 5) - Other names: 9-Phenanthrenecarbonitrile; 9-Phenanthronitrile; 9-Phenanthrenenitrile; Phenanthrene-9-carbonitrile

Lee's RI, non-polar column, temperature ramp

Column type | Active phase | I | Reference | Comment |
---|---|---|---|---|
Capillary | SE-52 | 351.81 | Vassilaros, Kong, et al., 1982 | 20. m/0.30 mm/0.25 μm, H2, 40. C @ 2. min, 4. K/min; Tend: 265. C |

Lee's RI, non-polar column, custom temperature program

Column type | Active phase | I | Reference | Comment |
---|---|---|---|---|
Capillary | OV-101 | 363.1 | Tucminen, Wickstrom, et al., 1986 | Program: not specified |

References

Vassilaros, Kong, et al., 1982
Vassilaros, D.L.; Kong, R.C.; Later, D.W.; Lee, M.L.,
Linear retention index system for polycyclic aromatic compounds. Critical evaluation and additional indices,
J. Chromatogr., 1982, 252, 1-20, https://doi.org/10.1016/S0021-9673(01)88394-1
. [all data]
Tucminen, Wickstrom, et al., 1986
Tucminen, A.; Wickstrom, K.; Pyysalo, H.,
Determination of Polycyclic Aromatic Compounds by GLC-Selected Ion Monitoring (SIM) Technique,
J. Hi. Res. Chromatogr. Chromatogr. Comm., 1986, 9, 8, 469-471, https://doi.org/10.1002/jhrc.1240090813
. [all data]