1,2,4-Pentatriene, 3-methyl-
- Formula: C6H8
- Molecular weight: 80.1277
- IUPAC Standard InChIKey: HWHWABOYRWRSPC-UHFFFAOYSA-N
- CAS Registry Number: 25054-29-9
- Chemical structure:
View 3d structure (requires JavaScript / HTML 5) - Permanent link for this species. Use this link for bookmarking this species for future reference.

Reaction thermochemistry data

Data compiled by: Hussein Y. Afeefy, Joel F. Liebman, and Stephen E. Stein
Individual Reactions
By formula: C6H8 = C6H8
Quantity | Value | Units | Method | Reference | Comment |
---|---|---|---|---|---|
ΔrH° | -8. ± 10. | kJ/mol | Kin | Hopf, Wachholz, et al., 1992 | gas phase; Heat of isomerization |
By formula: C6H8 = C6H8
Quantity | Value | Units | Method | Reference | Comment |
---|---|---|---|---|---|
ΔrH° | 8. ± 13. | kJ/mol | Kin | Hopf, Wachholz, et al., 1992 | gas phase; Heat of isomerization |

Gas phase ion energetics data

Data compiled as indicated in comments:
LLK - Sharon G. Lias, Rhoda D. Levin, and Sherif A. Kafafi
Ionization energy determinations
IE (eV) | Method | Reference | Comment |
---|---|---|---|
8.54 | PE | Delwiche, Praet, et al., 1979 | Vertical value; LLK |

References

Hopf, Wachholz, et al., 1992
Hopf, H.; Wachholz, G.; Walsh, R.,
The kinetics of thermal isomerisation of 4-methyl-1,2,5-hexatriene in the gas phase,
Chem. Ber., 1992, 125, 711-721. [all data]