Cycloheptene, 5-methyl-
- Formula: C8H14
- Molecular weight: 110.1968
- IUPAC Standard InChIKey: ASLRNQBBLPDZET-UHFFFAOYSA-N
- CAS Registry Number: 2505-06-8
- Chemical structure:
View 3d structure (requires JavaScript / HTML 5) - Other names: 5-Methylcycloheptene

Kovats' RI, non-polar column, isothermal

Column type | Active phase | Temperature (C) | I | Reference | Comment |
---|---|---|---|---|---|
Packed | Squalane | 70. | 851. | Bogoslovsky, Anvaer, et al., 1978 | |
Capillary | Squalane | 70. | 851. | Schomburg, 1966 |

References

Bogoslovsky, Anvaer, et al., 1978
Bogoslovsky, Yu.N.; Anvaer, B.I.; Vigdergauz, M.S.,
Chromatographic constants in gas chromatography (in Russian), Standards Publ. House, Moscow, 1978, 192. [all data]
Schomburg, 1966
Schomburg, G.,
Gaschromatographische Retentionsdaten und struktur chemischer verbindungen. III. Alkylverzweigte und ungesättigte cyclische Kohlenwasserstoffe,
J. Chromatogr., 1966, 23, 18-41, https://doi.org/10.1016/S0021-9673(01)98653-4
. [all data]