Methylenecycloheptane
- Formula: C8H14
- Molecular weight: 110.1968
- IUPAC Standard InChIKey: XJYOAWSHIQNEGC-UHFFFAOYSA-N
- CAS Registry Number: 2505-03-5
- Chemical structure:
View 3d structure (requires JavaScript / HTML 5) - Species with the same structure:

Phase change data

Data compiled by: Thermodynamics Research Center, NIST Boulder Laboratories, Chris Muzny director
Quantity | Value | Units | Method | Reference | Comment |
---|---|---|---|---|---|
Tboil | 408. | K | N/A | Turner and Garner, 1958 | Uncertainty assigned by TRC = 2. K |
Tboil | 412. | K | N/A | Traynham and Pascual, 1956 | Uncertainty assigned by TRC = 3. K |
Tboil | 406. | K | N/A | Sorm and Beranek, 1953 | Uncertainty assigned by TRC = 1. K |

Reaction thermochemistry data

Data compiled by: Hussein Y. Afeefy, Joel F. Liebman, and Stephen E. Stein
Individual Reactions
By formula: H2 + C8H14 = C8H16
Quantity | Value | Units | Method | Reference | Comment |
---|---|---|---|---|---|
ΔrH° | -109.9 ± 0.59 | kJ/mol | Chyd | Turner and Garner, 1958, 2 | liquid phase; solvent: Acetic acid |
ΔrH° | -109.9 ± 0.59 | kJ/mol | Chyd | Turner and Garner, 1957 | liquid phase; solvent: Acetic acid |

References

Turner and Garner, 1958
Turner, R.B.; Garner, R.H.,
Heats of Hydrogenation V. Relative Stabilities in Certain Exocyclic- Endocyclic Olefin Pairs,
J. Am. Chem. Soc., 1958, 80, 1424. [all data]
Traynham and Pascual, 1956
Traynham, J.G.; Pascual, O.S.,
J. Org. Chem., 1956, 21, 1362. [all data]
Sorm and Beranek, 1953
Sorm, F.; Beranek, J.,
Synthesis of methylenecycloalkanes,
Chem. Listy, 1953, 47, 708. [all data]
Turner and Garner, 1958, 2
Turner, R.B.; Garner, R.H.,
Heats of hydrogenation. V. Relative stabilities in certain exocyclic-endocyclic olefin pairs,
J. Am. Chem. Soc., 1958, 80, 1424-1430. [all data]
Turner and Garner, 1957
Turner, R.B.; Garner, R.H.,
Heats of hydrogenation. V. Relative stabilities in certain exocyclic-endocyclic olefin pairs,
J. Am. Chem. Soc., 1957, 80, 1424-1430. [all data]