p-Chlorophenylacetyl chloride
- Formula: C8H6Cl2O
- Molecular weight: 189.039
- IUPAC Standard InChIKey: UMQUIRYNOVNYPA-UHFFFAOYSA-N
- CAS Registry Number: 25026-34-0
- Chemical structure:
View 3d structure (requires JavaScript / HTML 5) - Other names: 4-Chlorophenacyl chloride; 4-Chlorophenylacetyl chloride; Benzeneacetyl chloride, 4-chloro-

Phase change data

Data compiled by: Robert L. Brown and Stephen E. Stein
Reduced pressure boiling point
Tboil (K) | Pressure (bar) | Reference |
---|---|---|
393. to 396. | 0.027 | Frinton Laboratories Inc., 1986 |

References

Frinton Laboratories Inc., 1986
Frinton Laboratories Inc.,
Catalog Number 11, Frinton Laboratories Inc., Vineland, NJ, 1986, 99. [all data]