2-Methoxy-1-butene
- Formula: C5H10O
- Molecular weight: 86.1323
- IUPAC Standard InChIKey: TXTDTCYVDJMLRP-UHFFFAOYSA-N
- CAS Registry Number: 25022-43-9
- Chemical structure:
View 3d structure (requires JavaScript / HTML 5) - Permanent link for this species. Use this link for bookmarking this species for future reference.

Reaction thermochemistry data

Data compiled by: Hussein Y. Afeefy, Joel F. Liebman, and Stephen E. Stein
Individual Reactions
By formula: C5H10O = C5H10O
Quantity | Value | Units | Method | Reference | Comment |
---|---|---|---|---|---|
ΔrH° | 0.11 ± 0.091 | kcal/mol | Eqk | Taskinen, 1974 | liquid phase; solvent: Cyclohexane; GLC |
By formula: C5H10O = C5H10O
Quantity | Value | Units | Method | Reference | Comment |
---|---|---|---|---|---|
ΔrH° | 2.5 ± 0.1 | kcal/mol | Eqk | Taskinen, 1974 | liquid phase; solvent: Cyclohexane; GLC |

References

Taskinen, 1974
Taskinen, E.,
Thermodynamics of vinyl ethers. III. On the relative stabilities of 2-methoxy-1-butene, (E)-2-methoxy-2-butene, and (Z)-2-methoxy-2-butene, and related isomeric compounds,
J. Chem. Thermodyn., 1974, 6, 345-353. [all data]