CAS Reg. No. 25012-81-1

Reaction thermochemistry data

Data compiled by: John E. Bartmess

Individual Reactions

(CAS Reg. No. 25012-81-1 • 4294967295Acetylene) + Acetylene = CAS Reg. No. 25012-81-1

By formula: (CAS Reg. No. 25012-81-1 • 4294967295C2H2) + C2H2 = CAS Reg. No. 25012-81-1

Quantity Value Units Method Reference Comment
Δr138.2 ± 3.0kJ/molN/AErvin, Gronert, et al., 1990gas phase

References

Ervin, Gronert, et al., 1990
Ervin, K.M.; Gronert, S.; Barlow, S.E.; Gilles, M.K.; Harrison, A.G.; Bierbaum, V.M.; DePuy, C.H.; Lin, W.C., Bonds Strengths of Ethylene and Acetylene, J. Am. Chem. Soc., 1990, 112, 15, 5750, https://doi.org/10.1021/ja00171a013 . [all data]