Butadiene-propylene copolymer

Phase change data

Data compiled by: Eugene S. Domalski and Elizabeth D. Hearing

Enthalpy of fusion

ΔfusH (kJ/mol) Temperature (K) Reference Comment
7.800262.Lebedev, Mukhina, et al., 1980100% crystallinity.

Entropy of fusion

ΔfusS (J/mol*K) Temperature (K) Reference Comment
29.8262.Lebedev, Mukhina, et al., 1980100%

References

Lebedev, Mukhina, et al., 1980
Lebedev, B.V.; Mukhina, N.N.; Bykova, T.A., The thermodynamics of regularly alternating butadiene-propylene copolymer (BPC) in the 0-400°K range, Vysokomol. Soedin., 1980, A22, 850-855. [all data]