Poly(4-methyl-1-pentene)

Condensed phase thermochemistry data

Data compiled by: Eugene S. Domalski and Elizabeth D. Hearing

Quantity Value Units Method Reference Comment
solid,1 bar151.5J/mol*KN/AMelia and Tyson, 1967Extrapolation below 80 K, 38.2 J/mol*K. Values do not include zero-point entropy.

Constant pressure heat capacity of solid

Cp,solid (J/mol*K) Temperature (K) Reference Comment
145.6298.15Melia and Tyson, 1967T = 80 to 310 K. Values per unit formula weight.

References

Melia and Tyson, 1967
Melia, T.P.; Tyson, A., Thermodynamics of addition polymerization. Part 2. The heat capacity, entropy and enthalpy of isotatic poly(4-methyl-1-pentene), Makromol. Chem., 1967, 109, 87-95. [all data]