3-Cyanobenzaldehyde
- Formula: C8H5NO
- Molecular weight: 131.1314
- IUPAC Standard InChIKey: HGZJJKZPPMFIBU-UHFFFAOYSA-N
- CAS Registry Number: 24964-64-5
- Chemical structure:
View 3d structure (requires JavaScript / HTML 5) - Other names: Benzonitrile, 3-formyl-; m-formylbenzonitrile

Phase change data

Data compiled by: Robert L. Brown and Stephen E. Stein
Quantity | Value | Units | Method | Reference | Comment |
---|---|---|---|---|---|
Tboil | 483.2 | K | N/A | Weast and Grasselli, 1989 |

Gas phase ion energetics data

Data compiled by: John E. Bartmess
Electron affinity determinations
EA (eV) | Method | Reference | Comment |
---|---|---|---|
0.967 ± 0.087 | IMRE | Mishima, Huh, et al., 1993 | ΔGea(343 K)=-22.9 kcal/mol. Reanchored to EA(PhNO2), Kebarle and Chowdhury, 1987. |
1.01 ± 0.10 | IMRE | Chowdhury and Kebarle, 1986 | ΔGea(423 K) = -23.3 kcal/mol; ΔSea (estimated) = 0. eu. |

References

Weast and Grasselli, 1989
CRC Handbook of Data on Organic Compounds, 2nd Editon, Weast,R.C and Grasselli, J.G., ed(s)., CRC Press, Inc., Boca Raton, FL, 1989, 1. [all data]
Mishima, Huh, et al., 1993
Mishima, M.; Huh, C.; Nakamura, H.; Fujio, M.; Tsuno, Y.,
Electron Affinities of Benzaldehydes. Substituent Effects on Stabilities of Aromatic Radical Anions.,
Tetrahed. Lett., 1993, 34, 26, 4223, https://doi.org/10.1016/S0040-4039(00)60533-6
. [all data]
Kebarle and Chowdhury, 1987
Kebarle, P.; Chowdhury, S.,
Electron affinities and electron transfer reactions,
Chem. Rev., 1987, 87, 513. [all data]
Chowdhury and Kebarle, 1986
Chowdhury, S.; Kebarle, P.,
Electron affinities of di- and tetracyanoethylene and cyanobenzenes based on measurements of gas-phase electron transfer equilibria,
J. Am. Chem. Soc., 1986, 108, 5453. [all data]