Bicyclo[3.1.1]heptan-2-one, 6,6-dimethyl-
- Formula: C9H14O
- Molecular weight: 138.2069
- IUPAC Standard InChIKey: XZFDKWMYCUEKSS-UHFFFAOYSA-N
- CAS Registry Number: 24903-95-5
- Chemical structure:
View 3d structure (requires JavaScript / HTML 5) - Species with the same structure:
- Stereoisomers:
- Other names: β-Pinone; Nopinon; Nopinone; 2-Norpinanone, 6,6-dimethyl-; 6,6-Dimethylbicyclo(3.1.1)heptan-2-one; nopinonee

Kovats' RI, non-polar column, temperature ramp

Column type | Active phase | I | Reference | Comment |
---|---|---|---|---|
Capillary | DB-5 | 1138. | Lucero, Fredrickson, et al., 2006 | 30. m/0.25 mm/0.25 μm, He, 3. K/min; Tstart: 60. C |
Capillary | DB-1 | 1117. | Mevy, Bessiere, et al., 2006 | He, 60. C @ 3. min, 3. K/min; Column length: 25. m; Column diameter: 0.2 mm; Tend: 220. C |

Kovats' RI, non-polar column, custom temperature program

Column type | Active phase | I | Reference | Comment |
---|---|---|---|---|
Capillary | HP-5 | 1138. | de Marchese, de Heluani, et al., 2007 | He; Program: 60C(5min) => 3C/min => 100C => 1C/min => 160C => 10C/min => 240C(10min) |

Van Den Dool and Kratz RI, non-polar column, temperature ramp

Column type | Active phase | I | Reference | Comment |
---|---|---|---|---|
Capillary | BP-1 | 1108. | Bousmaha, Boti, et al., 2006 | 50. m/0.25 mm/0.25 μm, He, 2. K/min, 220. C @ 20. min; Tstart: 60. C |
Capillary | BP-1 | 1108. | Gonny, Cavaleiro, et al., 2006 | 50. m/0.22 mm/0.25 μm, He, 2. K/min, 220. C @ 20. min; Tstart: 60. C |
Capillary | HP-5MS | 1139. | Kallio, Jussila, et al., 2006 | 20. m/0.25 mm/0.25 μm, 60. C @ 4. min, 5. K/min, 240. C @ 15. min |
Capillary | SPB-1 | 1129. | Radulovic, Lazarevic, et al., 2006 | 30. m/0.25 mm/0.25 μm, He, 50. C @ 3. min, 5. K/min, 250. C @ 15. min |
Capillary | RTX-1 | 1111. | Cozzani, Muselli, et al., 2005 | 60. m/0.22 mm/0.25 μm, 2. K/min, 220. C @ 20. min; Tstart: 60. C |
Capillary | SE-54 | 1131. | Alma, Nitz, et al., 2004 | 30. m/0.25 mm/0.25 μm, He, 60. C @ 5. min, 2. K/min; Tend: 260. C |
Capillary | SPB-1 | 1105. | Antunes, Sevinate-Pinto, et al., 2004 | 30. m/0.25 mm/0.25 μm, He, 3. K/min, 220. C @ 15. min; Tstart: 70. C |
Capillary | OV-1 | 1087. | Bicchi, Rubiolo, et al., 2003 | 25. m/0.25 mm/0.3 μm, H2, 50. C @ 1. min, 3. K/min, 200. C @ 20. min |
Capillary | RTX-1 | 1110. | Cavalli, Tomi, et al., 2003 | 60. m/0.22 mm/0.25 μm, He, 2. K/min, 230. C @ 45. min; Tstart: 60. C |
Capillary | HP-5MS | 1137. | Papandreou, Magiatis, et al., 2002 | 30. m/0.25 mm/0.25 μm, 60. C @ 5. min, 3. K/min; Tend: 280. C |
Capillary | CP Sil 5 CB | 1102. | Pino, Marbot, et al., 2002 | 25. m/0.25 mm/0.25 μm, N2, 60. C @ 6. min, 4. K/min; Tend: 280. C |
Capillary | CP Sil 8 CB | 1103. | Yassaa, Meklati, et al., 2000 | 25. m/0.2 mm/0.25 μm, 40. C @ 8. min, 2. K/min; Tend: 200. C |

Van Den Dool and Kratz RI, polar column, temperature ramp

Column type | Active phase | I | Reference | Comment |
---|---|---|---|---|
Capillary | BP-20 | 1577. | Bousmaha, Boti, et al., 2006 | 50. m/0.25 mm/0.25 μm, He, 2. K/min, 220. C @ 20. min; Tstart: 60. C |
Capillary | BP-20 | 1577. | Gonny, Cavaleiro, et al., 2006 | 50. m/0.22 mm/0.25 μm, He, 2. K/min, 220. C @ 20. min; Tstart: 60. C |
Capillary | RTX-Wax | 1562. | Cozzani, Muselli, et al., 2005 | 60. m/0.22 mm/0.25 μm, 2. K/min, 220. C @ 20. min; Tstart: 60. C |
Capillary | Carbowax 20M | 1548. | Bicchi, Rubiolo, et al., 2003 | 25. m/0.25 mm/0.3 μm, He, 50. C @ 1. min, 3. K/min, 200. C @ 20. min |
Capillary | RTX-Wax | 1565. | Cavalli, Tomi, et al., 2003 | 60. m/0.22 mm/0.25 μm, He, 2. K/min, 230. C @ 45. min; Tstart: 60. C |

Normal alkane RI, non-polar column, temperature ramp

Column type | Active phase | I | Reference | Comment |
---|---|---|---|---|
Capillary | HP-5 MS | 1135. | Zouari, Ayadi, et al., 2012 | 30. m/0.25 mm/0.25 μm, Helium, 50. C @ 1. min, 7. K/min, 250. C @ 5. min |
Capillary | HP-5 MS | 1143. | Radulovic, Dordevic, et al., 2010 | 30. m/0.25 mm/0.25 μm, Helium, 5. K/min, 290. C @ 10. min; Tstart: 70. C |
Capillary | DB-5 | 1136. | Pino, Marbot, et al., 2006 | 30. m/0.25 mm/0.25 μm, Hydrogen, 70. C @ 4. min, 4. K/min; Tend: 280. C |
Capillary | SPB-5 | 1137. | Stojanovic, Palic, et al., 2006 | He, 50. C @ 3. min, 5. K/min, 250. C @ 15. min |
Capillary | HP-5 | 1133. | Duarte, Figueira, et al., 2005 | 25. m/0.2 mm/0.33 μm, He, 3. K/min, 240. C @ 7. min; Tstart: 60. C |
Capillary | SPB-5 | 1145. | Gauvin, Ravaomanarivo, et al., 2004 | 60. m/0.32 mm/1. μm, He, 4. K/min, 200. C @ 30. min; Tstart: 60. C |
Capillary | HP-5MS | 1120. | Li and Jiang, 2004 | 30. m/0.25 mm/0.25 μm, He, 50. C @ 2. min, 5. K/min, 230. C @ 10. min |
Capillary | DB-1 | 1095. | Fekam Boyom, Ngouana, et al., 2003 | 30. m/0.25 mm/0.25 μm, N2, 5. K/min; Tstart: 50. C; Tend: 200. C |
Capillary | DB-5 | 1135. | Pino, Marbot, et al., 2003 | 30. m/0.25 mm/0.25 μm, H2, 60. C @ 10. min, 4. K/min, 280. C @ 40. min |
Capillary | DB-5 | 1137. | Kobaisy, Tellez, et al., 2002 | 30. m/0.25 mm/0.25 μm, He, 3. K/min; Tstart: 60. C; Tend: 240. C |
Capillary | DB-5 | 1133. | Mahmout, Bessière, et al., 2002 | 25. m/0.23 mm/0.15 μm, N2, 3. K/min; Tstart: 50. C; Tend: 250. C |
Capillary | DB-5 | 1137. | Tellez, Dayan, et al., 2000 | 30. m/0.25 mm/0.25 μm, He, 3. K/min; Tstart: 60. C; Tend: 240. C |
Capillary | DB-5 | 1137. | Tellez, Canel, et al., 1999 | 30. m/0.25 mm/0.25 μm, He, 3. K/min; Tstart: 60. C; Tend: 240. C |

Normal alkane RI, non-polar column, custom temperature program

Column type | Active phase | I | Reference | Comment |
---|---|---|---|---|
Capillary | 1090. | Karimi, Farmany, et al., 2011 | Program: not specified | |
Capillary | SLB-5 MS | 1139. | Costa, De Fina, et al., 2008 | 30. m/0.25 mm/0.25 μm, Helium; Program: 50 0C 3 0C/min -> 250 0C (1 min) 10 0C/min -> 300 0C (5 min) |
Capillary | SLB-5 MS | 1135. | Costa, De Fina, et al., 2008 | 30. m/0.25 mm/0.25 μm, Helium; Program: not specified |
Capillary | HP-5 MS | 1136. | Setzer, Stokes, et al., 2007 | Helium; Column length: 30. m; Column diameter: 0.25 mm; Program: 40 0C (10 min) 3 oC/min -> 200 0C 2 0C/min -> 220 0C |
Capillary | OV-1 | 1103. | El-Shazly and Hussein, 2004 | He; Column length: 15. m; Column diameter: 0.317 mm; Program: 50C(4min) => 4C/min => 90C => 10C/min => 300C(10min) |
Capillary | DB-5 | 1137. | Isidorov, Zenkevich, et al., 1997 | Program: not specified |

Normal alkane RI, polar column, temperature ramp

Column type | Active phase | I | Reference | Comment |
---|---|---|---|---|
Capillary | CP-Wax 52CB | 1594. | Chyau, Tsai, et al., 2007 | 60. m/0.25 mm/0.25 μm, He, 3. K/min; Tstart: 40. C; Tend: 220. C |
Capillary | Supelcowax-10 | 1556. | Gauvin, Ravaomanarivo, et al., 2004 | 60. m/0.2 mm/0.2 μm, He, 4. K/min, 200. C @ 40. min; Tstart: 60. C |

Normal alkane RI, polar column, custom temperature program

Column type | Active phase | I | Reference | Comment |
---|---|---|---|---|
Capillary | HP Innowax | 1597. | Noorizadeh and Farmany, 2010 | 60. m/0.25 mm/0.33 μm; Program: not specified |
Capillary | HP Innowax FSP | 1601. | Tabanca N., Demirci B., et al., 2007 | 60. m/0.25 mm/0.25 μm, N2; Program: 60C(10min) => 4C/min => 220C(10min) => 1C/min => 240C |
Capillary | HP-Innowax FSC | 1601. | Demirci B., Baser K.H.C., et al., 2006 | 60. m/0.25 mm/0.25 μm, N2; Program: 60C(10min) => 4C/min => 220C(10min) => 1C/min => 240C |
Capillary | CP-Wax 52CB | 1545. | Vernin, 1991 | Column length: 50. m; Column diameter: 0.32 mm; Program: not specified |

References

Lucero, Fredrickson, et al., 2006
Lucero, M.E.; Fredrickson, E.L.; Estell, R.E.; Morrison, A.A.; Richman, D.B.,
Volatile Composition of Gutierrezia sarothrae (Broom Snakeweed) as Determined by Steam Distillation and Solid Phase Microextraction,
J. Essent. Oil Res., 2006, 18, 2, 121-125, https://doi.org/10.1080/10412905.2006.9699039
. [all data]
Mevy, Bessiere, et al., 2006
Mevy, J.P.; Bessiere, J.M.; Rabier, J.; Dherbomez, M.; Ruzzier, M.; Millogo, J.; Viano, J.,
Composition and antimicrobial activities of the essential oil of Triumfetta rhomboidea Jacq.,
Flavour Fragr. J., 2006, 21, 1, 80-83, https://doi.org/10.1002/ffj.1511
. [all data]
de Marchese, de Heluani, et al., 2007
de Marchese, M.J.A.; de Heluani, C.S.; Catalán, C.A.N.; Griffin, C.A.; Vaughn, J.B., Jr.; Herz, W.,
Incisol, an alcohol with a novel sesquiterpene skeleton from Xenophyllum incisum,
Biochem. Syst. Ecol., 2007, 35, 3, 169-175, https://doi.org/10.1016/j.bse.2006.10.006
. [all data]
Bousmaha, Boti, et al., 2006
Bousmaha, L.; Boti, J.B.; Bekkara, F.A.; Castola, V.; Casanova, J.,
Infraspecific chemical variability of the essential oil of Lavandula dentata L. from Algeria,
Flavour Fragr. J., 2006, 21, 2, 368-372, https://doi.org/10.1002/ffj.1659
. [all data]
Gonny, Cavaleiro, et al., 2006
Gonny, M.; Cavaleiro, C.; Salgueiro, L.; Casanova, J.,
Analysis of Juniperus communis subsp. alpina needle, berry, wood and root oils by combination of GC, GC/MS and 13C-NMR,
Flavour Fragr. J., 2006, 21, 1, 99-106, https://doi.org/10.1002/ffj.1527
. [all data]
Kallio, Jussila, et al., 2006
Kallio, M.; Jussila, M.; Rissanen, T.; Anttila, P.; Hartonen, K.; Reissell, A.; Vreuls, R.; Adahchour, M.; Hyotylainen, T.,
Comprehensive two-dimensional gas chromatography coupled to time-of-flight mass spectrometry in the identification of organic compounds in atmospheric aerosols from coniferous forest,
J. Chromatogr. A, 2006, 1125, 2, 234-243, https://doi.org/10.1016/j.chroma.2006.05.050
. [all data]
Radulovic, Lazarevic, et al., 2006
Radulovic, N.; Lazarevic, J.; Stojanovic, G.; Palic, R.,
Chemotaxonomically significant 2-ethyl substituted fatty acids from Stachys milanii Petrovic (Lamiaceae),
Biochem. Syst. Ecol., 2006, 34, 4, 341-344, https://doi.org/10.1016/j.bse.2005.10.008
. [all data]
Cozzani, Muselli, et al., 2005
Cozzani, S.; Muselli, A.; Desjobert, J.-M.; Bernardini, A.-F.; Tomi, F.; Casanova, J.,
Chemical composition of essential oil of Teucrium polium subsp. capitatum (L.) from Corsica,
Flavour Fragr. J., 2005, 20, 4, 436-441, https://doi.org/10.1002/ffj.1463
. [all data]
Alma, Nitz, et al., 2004
Alma, M.H.; Nitz, S.; Kollmannsberger, H.; Digrak, M.; Efe, F.T.; Yilmaz, N.,
Chemical composition and antimicrobial activity of the essential oils from the gum of Turkish Pistachio (Pistacia vera L.),
J. Agric. Food Chem., 2004, 52, 12, 3911-3914, https://doi.org/10.1021/jf040014e
. [all data]
Antunes, Sevinate-Pinto, et al., 2004
Antunes, T.; Sevinate-Pinto, I.; Barroso, J.G.; Cavaleiro, C.; Salgueiro, L.R.,
Micromorphology of trichomes and composition of essential oil of Teucrium capitatum,
Flavour Fragr. J., 2004, 19, 4, 336-340, https://doi.org/10.1002/ffj.1310
. [all data]
Bicchi, Rubiolo, et al., 2003
Bicchi, C.; Rubiolo, P.; Camargo, E.E.S.; Vilegas, W.; Gracioso, J.S.; Brito, A.R.M.S.,
Components of Turnera diffusa Willd. var. afrodisiaca (Ward) Urb. essential oil,
Flavour Fragr. J., 2003, 18, 1, 59-61, https://doi.org/10.1002/ffj.1155
. [all data]
Cavalli, Tomi, et al., 2003
Cavalli, J.-F.; Tomi, F.; Bernardini, A.-F.; Casanova, J.,
Composition and chemical variability of the bark oil of Cedrelopsis grevei H. Baillon from Madagascar,
Flavour Fragr. J., 2003, 18, 6, 532-538, https://doi.org/10.1002/ffj.1263
. [all data]
Papandreou, Magiatis, et al., 2002
Papandreou, V.; Magiatis, P.; Chinou, I.; Kalpoutzakis, E.; Skaltsounis, A.-L.; Tsarbopoulos, A.,
Volatiles with antimicrobial activity from the roots of Greek Paeonia taxa,
J. Ethnopharmacol., 2002, 81, 1, 101-104, https://doi.org/10.1016/S0378-8741(02)00056-9
. [all data]
Pino, Marbot, et al., 2002
Pino, J.A.; Marbot, R.; Quert, R.; García, H.,
Study of essential oils of Eucalyptus resinifera Smith, E. tereticornis Smith and Corymbia maculata (Hook.) K.D. Hill L.A.S. Johnson, grown in Cuba,
Flavour Fragr. J., 2002, 17, 1, 1-4, https://doi.org/10.1002/ffj.1026
. [all data]
Yassaa, Meklati, et al., 2000
Yassaa, N.; Meklati, B.Y.; Cecinato, A.,
Evaluation of monoterpenic biogenic volatile organic compounds in ambient air around Eucalyptus globulus, Pinus halepensis and Cedrus atlantica trees growing in Algiers city area by chiral and achiral capillary gas chromatography,
Atmos. Environ., 2000, 34, 17, 2809-2816, https://doi.org/10.1016/S1352-2310(99)00436-7
. [all data]
Zouari, Ayadi, et al., 2012
Zouari, N.; Ayadi, I.; Fakhfakh, N.; Rebai, A.; Zouari, S.,
Variations of chemical composition of essential oils in wild-populations of Thymus algeriensis Boiss et Reut., a North African endemic species,
Lipids in Health and Desease, 2012, 11, 1, 28-39, https://doi.org/10.1186/1476-511X-11-28
. [all data]
Radulovic, Dordevic, et al., 2010
Radulovic, N.; Dordevic, N.; Markovic, M.; Palic, R.,
Volatile constituents of Glechoma Hirsuta Waldst. Kit. and G. Hederacea L. (Lamiaceae),
Bull. Chem. Soc. Ethiop., 2010, 24, 1, 67-76, https://doi.org/10.4314/bcse.v24i1.52962
. [all data]
Pino, Marbot, et al., 2006
Pino, J.A.; Marbot, R.; Payo, A.; Chao, D.; Herrera, P.,
Aromatic Plants from Western Cuba VII. Composition of the Leaf Oil of Psidium wrightii KRug et Urb., Lantana involucrata L., Cinnamonum montanum (Sw.) Berchtold et J. Persl. and Caesalpinia violacea (Mill.) Standley,
J. Essent. Oil. Res., 2006, 18, 2, 170-174, https://doi.org/10.1080/10412905.2006.9699058
. [all data]
Stojanovic, Palic, et al., 2006
Stojanovic, G.; Palic, I.; Ursic-Jankovic, J.,
Composition and antimicrobial activity of the essential oil of Micromeria cristata and Micromeria juliana,
Flavour Fragr. J., 2006, 21, 1, 77-79, https://doi.org/10.1002/ffj.1507
. [all data]
Duarte, Figueira, et al., 2005
Duarte, M.C.T.; Figueira, G.M.; Sartoratto, A.; Rehder, V.L.G.; Delarmelina, C.,
Anti-Candida activity of Brazilian medicinal plants,
J. Ethnopharmacol., 2005, 97, 2, 305-311, https://doi.org/10.1016/j.jep.2004.11.016
. [all data]
Gauvin, Ravaomanarivo, et al., 2004
Gauvin, A.; Ravaomanarivo, H.; Smadja, J.,
Comparative analysis by gas chromatography?mass spectrometry of the essential oils from bark and leaves of Cedrelopsis grevei Baill, an aromatic and medicinal plant from Madagascar,
J. Chromatogr. A, 2004, 1029, 1-2, 279-282, https://doi.org/10.1016/j.chroma.2003.12.012
. [all data]
Li and Jiang, 2004
Li, R.; Jiang, Z.-T.,
Chemical composition of the essential oil of Cuminum cyminum L. from China,
Flavour Fragr. J., 2004, 19, 4, 311-313, https://doi.org/10.1002/ffj.1302
. [all data]
Fekam Boyom, Ngouana, et al., 2003
Fekam Boyom, F.; Ngouana, V.; Amvam Zollo, P.H.; Menut, C.; Bessiere, J.M.; Gut, J.; Rosenthal, P.J.,
Composition and anti-plasmodial activities of essential oils from some Cameroonian medicinal plants,
Phytochemistry, 2003, 64, 7, 1269-1275, https://doi.org/10.1016/j.phytochem.2003.08.004
. [all data]
Pino, Marbot, et al., 2003
Pino, J.A.; Marbot, R.; Fuentes, V.,
Characterization of volatiles in Bullock's heart (Annona reticulata L.) fruit cultivars from Cuba,
J. Agric. Food Chem., 2003, 51, 13, 3836-3839, https://doi.org/10.1021/jf020733y
. [all data]
Kobaisy, Tellez, et al., 2002
Kobaisy, M.; Tellez, M.R.; Dayan, F.E.; Duke, S.O.,
Phytotoxicity and volatile constituents from leaves of Callicarpa japonica Thunb.,
Phytochemistry, 2002, 61, 1, 37-40, https://doi.org/10.1016/S0031-9422(02)00207-8
. [all data]
Mahmout, Bessière, et al., 2002
Mahmout, Y.; Bessière, J.-M.; Dolmazon, R.,
Constituents of the essential oil of Cyperus maculatus Boëck,
J. Essent. Oil Res., 2002, 14, 4, 263-265, https://doi.org/10.1080/10412905.2002.9699848
. [all data]
Tellez, Dayan, et al., 2000
Tellez, M.R.; Dayan, F.E.; Schrader, K.K.; Wedge, D.E.; Duke, S.O.,
Composition and some biological activities of the essential oils of Callicarpa Americana (L.),
J. Agric. Food Chem., 2000, 48, 7, 3008-3012, https://doi.org/10.1021/jf991026g
. [all data]
Tellez, Canel, et al., 1999
Tellez, M.R.; Canel, C.; Rimando, A.M.; Duke, S.O.,
Differential accumulation of isoprenoids in glanded and glandless Artemisia annua L,
Phytochemistry, 1999, 52, 6, 1035-1040, https://doi.org/10.1016/S0031-9422(99)00308-8
. [all data]
Karimi, Farmany, et al., 2011
Karimi, H.; Farmany, A.; Noorizadeh, H.,
Prediction of linear retention index of Teucrium chamaedrys volatiles in GCxGC-TOF/MS by linear model,
World Appl. Sci. J., 2011, 15, 8, 1086-1088. [all data]
Costa, De Fina, et al., 2008
Costa, R.; De Fina, M.R.; Valentino, M.R.; Rustaiyan, A.; Dugo, P.; Dugo, G.; Mondello, L.,
An investigation on the volatile composition of some Artemisia species from Iran,
Flavour Fragr. J., 2008, 24, 2, 75-82, https://doi.org/10.1002/ffj.1919
. [all data]
Setzer, Stokes, et al., 2007
Setzer, W.N.; Stokes, S.L.; Penton, A.F.; Takaku, S.; Haber, W.A.; Hansell, E.; Caffrey, C.R.; McKerrow, J.H.,
Cruzain inhibitory activity of leaf essential oils of neotropical Lauraceae and essential oil components,
Natural Product Communications, 2007, 2, 12, 1203-1210. [all data]
El-Shazly and Hussein, 2004
El-Shazly, A.M.; Hussein, K.T.,
Chemical analysis and biological activities of the essential oil of Teucrium leucocladum Boiss. (Lamiaceae),
Biochem. Syst. Ecol., 2004, 32, 7, 665-674, https://doi.org/10.1016/j.bse.2003.12.009
. [all data]
Isidorov, Zenkevich, et al., 1997
Isidorov, V.; Zenkevich, I.; Sacharevich, T.,
Calculation of Gas Chromatographic Retention Indices for Monoterpenes and Terpenoids from Their Physico-Chemical Constants,
Chem. Anal. (Warsaw), 1997, 42, 627-634. [all data]
Chyau, Tsai, et al., 2007
Chyau, C.-C.; Tsai, S.-Y.; Yang, J.-H.; Weng, C.-C.; Han, C.-M.; Shih, C.-C.; Mau, J.-L.,
The essential oil of Glossogyne tenuifolia,
Food Chem., 2007, 100, 2, 808-812, https://doi.org/10.1016/j.foodchem.2005.10.044
. [all data]
Noorizadeh and Farmany, 2010
Noorizadeh, H.; Farmany, A.,
Exploration of linear and nonlinear modeling techniques to predict of retention index of essential oils,
J. Chin. Chem. Soc., 2010, 1268-1277. [all data]
Tabanca N., Demirci B., et al., 2007
Tabanca N.; Demirci B.; Crockett S.L.; Baser K.H.C.; Wedge D.E.,
Chemical composition and antifungal activity of Arnica longifolia, Aster hesperius, and Chrysothamnus nauseosus essential oils,
J. Agric. Food Chem., 2007, 55, 21, 8430-8435, https://doi.org/10.1021/jf071379c
. [all data]
Demirci B., Baser K.H.C., et al., 2006
Demirci B.; Baser K.H.C.; Tabanca N.; Wedge D.E.,
Characterization of volatile constituents of Haplopappus greenei and studies on the antifungal activity against phytopathogens,
J. Agric. Food Chem., 2006, 54, 8, 3146-3150, https://doi.org/10.1021/jf053222v
. [all data]
Vernin, 1991
Vernin, G.,
Volatile constituents of the essential oil of Santolina chamaecyparissus L.,
J. Essent. Oil Res., 1991, 3, 1, 49-53, https://doi.org/10.1080/10412905.1991.9697907
. [all data]