Trimethoxy silane
- Formula: C3H10O3Si
- Molecular weight: 122.1952
- IUPAC Standard InChIKey: YUYCVXFAYWRXLS-UHFFFAOYSA-N
- CAS Registry Number: 2487-90-3
- Chemical structure:
View 3d structure (requires JavaScript / HTML 5) - Other names: Silanem trimethoxy

Phase change data

Data compiled by: Thermodynamics Research Center, NIST Boulder Laboratories, Chris Muzny director
Quantity | Value | Units | Method | Reference | Comment |
---|---|---|---|---|---|
Tfus | 158.35 | K | N/A | Sternbach and MacDiarmid, 1959 | Uncertainty assigned by TRC = 0.3 K |

Normal alkane RI, non-polar column, temperature ramp

Column type | Active phase | I | Reference | Comment |
---|---|---|---|---|
Capillary | OV-101 | 650. | Zenkevich, 2005 | 25. m/0.20 mm/0.10 μm, N2/He, 6. K/min; Tstart: 50. C; Tend: 250. C |

References

Sternbach and MacDiarmid, 1959
Sternbach, B.; MacDiarmid, A.G.,
The Preparation of Methoxysilanes by the Interaction of Monosilane and Methanol,
J. Am. Chem. Soc., 1959, 81, 5109-10. [all data]
Zenkevich, 2005
Zenkevich, I.G.,
Experimentally measured retention indices., 2005. [all data]