Propane, 1,1,1-trimethoxy-
- Formula: C6H14O3
- Molecular weight: 134.1736
- IUPAC Standard InChIKey: ZGMNAIODRDOMEK-UHFFFAOYSA-N
- CAS Registry Number: 24823-81-2
- Chemical structure:
View 3d structure (requires JavaScript / HTML 5) - Other names: TRIMETHYL ORTHOPROPIONATE

Gas phase thermochemistry data

Data compiled by: Hussein Y. Afeefy, Joel F. Liebman, and Stephen E. Stein
Quantity | Value | Units | Method | Reference | Comment |
---|---|---|---|---|---|
ΔfH°gas | -591.7 ± 4.4 | kJ/mol | Eqk | Guthrie and Cullimore, 1980 |

Condensed phase thermochemistry data

Data compiled by: Hussein Y. Afeefy, Joel F. Liebman, and Stephen E. Stein
Quantity | Value | Units | Method | Reference | Comment |
---|---|---|---|---|---|
ΔfH°liquid | -634.2 ± 1.1 | kJ/mol | Eqk | Guthrie and Cullimore, 1980 |

Phase change data

Data compiled as indicated in comments:
ALS - Hussein Y. Afeefy, Joel F. Liebman, and Stephen E. Stein
DRB - Donald R. Burgess, Jr.
Quantity | Value | Units | Method | Reference | Comment |
---|---|---|---|---|---|
ΔvapH° | 42.5 ± 4.2 | kJ/mol | E | Guthrie and Cullimore, 1980 | ALS |
ΔvapH° | 42.5 | kJ/mol | N/A | Guthrie and Cullimore, 1980 | DRB |

Reaction thermochemistry data

Data compiled by: Hussein Y. Afeefy, Joel F. Liebman, and Stephen E. Stein
Individual Reactions
By formula: C6H14O3 + H2O = C4H8O2 + 2CH4O
Quantity | Value | Units | Method | Reference | Comment |
---|---|---|---|---|---|
ΔrH° | -26.12 ± 0.067 | kJ/mol | Cm | Wiberg, Martin, et al., 1985 | liquid phase; solvent: Aqueous dioxane |
ΔrH° | -51.76 ± 0.54 | kJ/mol | Eqk | Guthrie and Cullimore, 1980 | liquid phase |
ΔrH° | -26.28 ± 0.071 | kJ/mol | Cm | Wiberg, 1980 | liquid phase; solvent: Water; Hydrolysis |

References

Guthrie and Cullimore, 1980
Guthrie, J.P.; Cullimore, P.A.,
Effect of the acyl substituent on the equilibrium constant for hydration of esters,
Can. J. Chem., 1980, 58, 1281-1294. [all data]
Wiberg, Martin, et al., 1985
Wiberg, K.B.; Martin, E.J.; Squires, R.R.,
Thermochemical studies of carbonyl compounds. 3. Enthalpies of hydrolysis of ortho esters,
J. Org. Chem., 1985, 50, 4717-4720. [all data]
Wiberg, 1980
Wiberg, K.B.,
Energies of organic compounds,
Rept. DOE-E(11-1)4060 Prepared for US Dept. of Energy by Yale Univ., New Haven, CT. Avail. NTIS, 1980, 1-24. [all data]