4-Benzoyl-1-naphthol
- Formula: C17H12O2
- Molecular weight: 248.2760
- IUPAC Standard InChIKey: VANIRKXGZSRTMW-UHFFFAOYSA-N
- CAS Registry Number: 24776-44-1
- Chemical structure:
View 3d structure (requires JavaScript / HTML 5) - Permanent link for this species. Use this link for bookmarking this species for future reference.

Phase change data

Data compiled as indicated in comments:
TRC - Thermodynamics Research Center, NIST Boulder Laboratories, Chris Muzny director
AC - William E. Acree, Jr., James S. Chickos
Quantity | Value | Units | Method | Reference | Comment |
---|---|---|---|---|---|
Tfus | 440.50 | K | N/A | Domanska, 1990 | Uncertainty assigned by TRC = 0.1 K; TRC |
Enthalpy of fusion
ΔfusH (kJ/mol) | Temperature (K) | Method | Reference | Comment |
---|---|---|---|---|
28.64 | 440.6 | DSC | Acree, 1991 | AC |

References

Domanska, 1990
Domanska, U.,
Solubility of benzoyl-substituted naphthols in mixtures of hexane and 1-butanol,
Ind. Eng. Chem. Res., 1990, 29, 470. [all data]
Acree, 1991
Acree, William E.,
Thermodynamic properties of organic compounds: enthalpy of fusion and melting point temperature compilation,
Thermochimica Acta, 1991, 189, 1, 37-56, https://doi.org/10.1016/0040-6031(91)87098-H
. [all data]